BDBM50295482 (R)-3-Methyl-2-(7-(methylsulfonamido)dibenzo[b,d]thiophene-2-sulfonamido)butanoic acid::CHEMBL552376
SMILES: CC(C)[C@@H](NS(=O)(=O)c1ccc2sc3cc(NS(C)(=O)=O)ccc3c2c1)C(O)=O
InChI Key: InChIKey=JUTPKTDNWMOAGF-QGZVFWFLSA-N
Data: 2 IC50
Activity Spreadsheet -- Enzyme Inhibition Constant Data from BindingDB
Found 2 hits for monomerid = 50295482
Trg + Lig
Ki
nM
ΔG°
kcal/mole
IC50
nM
Kd
nM
EC50/IC50
nM
koff
s-1
kon
M-1s-1
pHTemp
°C
Collagenase 3
(Homo sapiens (Human))
BDBM50295482
((R)-3-Methyl-2-(7-(methylsulfonamido)dibenzo[b,d]t...)
Show SMILES CC(C)[C@@H](NS(=O)(=O)c1ccc2sc3cc(NS(C)(=O)=O)ccc3c2c1)C(O)=O |r|
Show InChI InChI=1S/C18H20N2O6S3/c1-10(2)17(18(21)22)20-29(25,26)12-5-7-15-14(9-12)13-6-4-11(8-16(13)27-15)19-28(3,23)24/h4-10,17,19-20H,1-3H3,(H,21,22)/t17-/m1/s1
NCI pathway
Reactome pathway
n/an/a>2.50E+4n/an/an/an/an/an/a
Wyeth Research
Curated by ChEMBL
Assay Description
Inhibition of human recombinant MMP13
J Med Chem 52: 5408-19 (2009)
Article DOI: 10.1021/jm900809r
BindingDB Entry DOI: 10.7270/Q21J99SW
Matrix metalloproteinase-12 (MMP12)
(Homo sapiens (Human))
BDBM50295482
((R)-3-Methyl-2-(7-(methylsulfonamido)dibenzo[b,d]t...)
Show SMILES CC(C)[C@@H](NS(=O)(=O)c1ccc2sc3cc(NS(C)(=O)=O)ccc3c2c1)C(O)=O |r|
Show InChI InChI=1S/C18H20N2O6S3/c1-10(2)17(18(21)22)20-29(25,26)12-5-7-15-14(9-12)13-6-4-11(8-16(13)27-15)19-28(3,23)24/h4-10,17,19-20H,1-3H3,(H,21,22)/t17-/m1/s1
Reactome pathway
n/an/a 4.40E+3n/an/an/an/an/an/a
Wyeth Research
Curated by ChEMBL
Assay Description
Inhibition of human recombinant MMP12
J Med Chem 52: 5408-19 (2009)
Article DOI: 10.1021/jm900809r
BindingDB Entry DOI: 10.7270/Q21J99SW