BDBM50295494 (R)-2-(7-(Ethoxycarbonylamino)dibenzo[b,d]thiophene-3-sulfonamido)-3-methylbutanoic Acid::CHEMBL562374
SMILES: CCOC(=O)Nc1ccc2c(c1)sc1cc(ccc21)S(=O)(=O)N[C@H](C(C)C)C(O)=O
InChI Key: InChIKey=ZURXLNWQPVEFOH-GOSISDBHSA-N
Data: 1 IC50
Activity Spreadsheet -- Enzyme Inhibition Constant Data from BindingDB
Found 1 hit for monomerid = 50295494
Trg + Lig
Ki
nM
ΔG°
kcal/mole
IC50
nM
Kd
nM
EC50/IC50
nM
koff
s-1
kon
M-1s-1
pHTemp
°C
Matrix metalloproteinase-12 (MMP12)
(Homo sapiens (Human))
BDBM50295494
((R)-2-(7-(Ethoxycarbonylamino)dibenzo[b,d]thiophen...)
Show SMILES CCOC(=O)Nc1ccc2c(c1)sc1cc(ccc21)S(=O)(=O)N[C@H](C(C)C)C(O)=O |r|
Show InChI InChI=1S/C20H22N2O6S2/c1-4-28-20(25)21-12-5-7-14-15-8-6-13(10-17(15)29-16(14)9-12)30(26,27)22-18(11(2)3)19(23)24/h5-11,18,22H,4H2,1-3H3,(H,21,25)(H,23,24)/t18-/m1/s1
Reactome pathway
n/an/a 100n/an/an/an/an/an/a
Wyeth Research
Curated by ChEMBL
Assay Description
Inhibition of human recombinant MMP12
J Med Chem 52: 5408-19 (2009)
Article DOI: 10.1021/jm900809r
BindingDB Entry DOI: 10.7270/Q21J99SW