null
SMILES: Cn1c(cc(=O)n(C)c1=O)N1CCCN(CCCN2c3ccccc3Sc3cccc(C(O)=O)c23)CC1
InChI Key: InChIKey=GGTPJIUWVNXICI-UHFFFAOYSA-N
Activity Spreadsheet -- Enzyme Inhibition Constant Data from BindingDB
Found 1 hit for monomerid = 50295713
Trg + Lig
Ki
nM
ΔG°
kcal/mole
IC50
nM
Kd
nM
EC50/IC50
nM
koff
s-1
kon
M-1s-1
pHTemp
°C
Histamine H1 receptor
(Homo sapiens (Human))
BDBM50295713
(10-(3-(4-(1,3-dimethyl-2,6-dioxo-1,2,3,6-tetrahydr...)
Show SMILES Cn1c(cc(=O)n(C)c1=O)N1CCCN(CCCN2c3ccccc3Sc3cccc(C(O)=O)c23)CC1
Show InChI InChI=1S/C27H31N5O4S/c1-28-23(18-24(33)29(2)27(28)36)31-14-6-12-30(16-17-31)13-7-15-32-20-9-3-4-10-21(20)37-22-11-5-8-19(25(22)32)26(34)35/h3-5,8-11,18H,6-7,12-17H2,1-2H3,(H,34,35)
Reactome pathway
n/an/a>500n/an/an/an/an/an/a
Dainippon Sumitomo Phrama. Co. Ltd
Curated by ChEMBL
Assay Description
Displacement of [3H]pyrilamine from human recombinant histamine H1 receptor expressed in CHOK1 cells by scintillation counting
Bioorg Med Chem Lett 19: 2766-71 (2009)
Article DOI: 10.1016/j.bmcl.2009.03.124
BindingDB Entry DOI: 10.7270/Q2GM87BK