null
SMILES: Cn1c(cc(=O)n(C)c1=O)N1CCN(CCCN2c3ccccc3Sc3ccc(cc23)C(O)=O)CC1
InChI Key: InChIKey=PPLDJNZKOFVZGW-UHFFFAOYSA-N
Activity Spreadsheet -- Enzyme Inhibition Constant Data from BindingDB
Found 1 hit for monomerid = 50295715
Trg + Lig
Ki
nM
ΔG°
kcal/mole
IC50
nM
Kd
nM
EC50/IC50
nM
koff
s-1
kon
M-1s-1
pHTemp
°C
Histamine H1 receptor
(Homo sapiens (Human))
BDBM50295715
(10-(3-(4-(1,3-dimethyl-2,6-dioxo-1,2,3,6-tetrahydr...)
Show SMILES Cn1c(cc(=O)n(C)c1=O)N1CCN(CCCN2c3ccccc3Sc3ccc(cc23)C(O)=O)CC1
Show InChI InChI=1S/C26H29N5O4S/c1-27-23(17-24(32)28(2)26(27)35)30-14-12-29(13-15-30)10-5-11-31-19-6-3-4-7-21(19)36-22-9-8-18(25(33)34)16-20(22)31/h3-4,6-9,16-17H,5,10-15H2,1-2H3,(H,33,34)
Reactome pathway
n/an/a 37n/an/an/an/an/an/a
Dainippon Sumitomo Phrama. Co. Ltd
Curated by ChEMBL
Assay Description
Displacement of [3H]pyrilamine from human recombinant histamine H1 receptor expressed in CHOK1 cells by scintillation counting
Bioorg Med Chem Lett 19: 2766-71 (2009)
Article DOI: 10.1016/j.bmcl.2009.03.124
BindingDB Entry DOI: 10.7270/Q2GM87BK