null
SMILES: Cn1cc(C2=C(C(=O)NC2=O)c2cn(CCN3CCOCC3)c3ccccc23)c2ncccc12
InChI Key: InChIKey=DNZPLHJMJSXPSW-UHFFFAOYSA-N
Activity Spreadsheet -- Enzyme Inhibition Constant Data from BindingDB
Found 1 hit for monomerid = 50295907
Trg + Lig
Ki
nM
ΔG°
kcal/mole
IC50
nM
Kd
nM
EC50/IC50
nM
koff
s-1
kon
M-1s-1
pHTemp
°C
Glycogen synthase kinase-3 beta
(Homo sapiens (Human))
BDBM50295907
(3-(1-Methyl-1H-pyrrolo[3,2-b]pyridin-3-yl)-4-(1-(2...)
Show SMILES Cn1cc(C2=C(C(=O)NC2=O)c2cn(CCN3CCOCC3)c3ccccc23)c2ncccc12 |t:4|
Show InChI InChI=1S/C26H25N5O3/c1-29-15-19(24-21(29)7-4-8-27-24)23-22(25(32)28-26(23)33)18-16-31(20-6-3-2-5-17(18)20)10-9-30-11-13-34-14-12-30/h2-8,15-16H,9-14H2,1H3,(H,28,32,33)
NCI pathway
Reactome pathway
n/an/a 900n/an/an/an/an/an/a
Zhejiang University
Curated by ChEMBL
Assay Description
Inhibition of recombinant GST-GSK3beta expressed in Escherichia coli BL21 (DE3)
Bioorg Med Chem 17: 4302-12 (2009)
Article DOI: 10.1016/j.bmc.2009.05.031
BindingDB Entry DOI: 10.7270/Q2XP750M