BDBM50296189 1-{3-[4-(3-Methyl-4,4-dioxo-4H-4lambda*6*-benzo[1,4]oxathiin-2-yl)-phenoxy]-propyl}-pyrrolidine::CHEMBL556100
SMILES: CC1=C(Oc2ccccc2S1(=O)=O)c1ccc(OCCCN2CCCC2)cc1
InChI Key: InChIKey=KIJIJUXKXSTTLC-UHFFFAOYSA-N
Data: 1 KI  3 IC50
Activity Spreadsheet -- Enzyme Inhibition Constant Data from BindingDB
Found 4 hits for monomerid = 50296189
Trg + Lig
Ki
nM
ΔG°
kcal/mole
IC50
nM
Kd
nM
EC50/IC50
nM
koff
s-1
kon
M-1s-1
pHTemp
°C
Histamine H3 receptor
(Homo sapiens (Human))
BDBM50296189
(1-{3-[4-(3-Methyl-4,4-dioxo-4H-4lambda*6*-benzo[1,...)
Show SMILES CC1=C(Oc2ccccc2S1(=O)=O)c1ccc(OCCCN2CCCC2)cc1 |t:1|
Show InChI InChI=1S/C22H25NO4S/c1-17-22(27-20-7-2-3-8-21(20)28(17,24)25)18-9-11-19(12-10-18)26-16-6-15-23-13-4-5-14-23/h2-3,7-12H,4-6,13-16H2,1H3
Reactome pathway
0.900n/an/an/an/an/an/an/an/a
Bioprojet-Biotech
Curated by ChEMBL
Assay Description
Displacement of [125I]Iodoproxyfan from human recombinant histamine H3 receptor by Competitive binding assay
Bioorg Med Chem Lett 21: 5378-83 (2011)
Article DOI: 10.1016/j.bmcl.2011.07.006
BindingDB Entry DOI: 10.7270/Q2VX0GXK
Potassium voltage-gated channel subfamily H member 2
(Homo sapiens (Human))
BDBM50296189
(1-{3-[4-(3-Methyl-4,4-dioxo-4H-4lambda*6*-benzo[1,...)
Show SMILES CC1=C(Oc2ccccc2S1(=O)=O)c1ccc(OCCCN2CCCC2)cc1 |t:1|
Show InChI InChI=1S/C22H25NO4S/c1-17-22(27-20-7-2-3-8-21(20)28(17,24)25)18-9-11-19(12-10-18)26-16-6-15-23-13-4-5-14-23/h2-3,7-12H,4-6,13-16H2,1H3
Reactome pathway
n/an/a 470n/an/an/an/an/an/a
Bioprojet-Biotech
Curated by ChEMBL
Assay Description
Displacement of [3H]dofetilide from human recombinant ERG by Competitive binding assay
Bioorg Med Chem Lett 21: 5378-83 (2011)
Article DOI: 10.1016/j.bmcl.2011.07.006
BindingDB Entry DOI: 10.7270/Q2VX0GXK
Histamine H3 receptor
(Homo sapiens (Human))
BDBM50296189
(1-{3-[4-(3-Methyl-4,4-dioxo-4H-4lambda*6*-benzo[1,...)
Show SMILES CC1=C(Oc2ccccc2S1(=O)=O)c1ccc(OCCCN2CCCC2)cc1 |t:1|
Show InChI InChI=1S/C22H25NO4S/c1-17-22(27-20-7-2-3-8-21(20)28(17,24)25)18-9-11-19(12-10-18)26-16-6-15-23-13-4-5-14-23/h2-3,7-12H,4-6,13-16H2,1H3
Reactome pathway
n/an/a 0.840n/an/an/an/an/an/a
Tsukuba Research Institute
Curated by ChEMBL
Assay Description
Inverse agonist activity at human cloned histamine H3 receptor assessed as inhibition of R-alpha-methylistamine-induced [35S]GTPgammaS binding by cel...
Bioorg Med Chem Lett 19: 4232-6 (2009)
Article DOI: 10.1016/j.bmcl.2009.05.101
BindingDB Entry DOI: 10.7270/Q20G3K69
Potassium voltage-gated channel subfamily H member 2
(Homo sapiens (Human))
BDBM50296189
(1-{3-[4-(3-Methyl-4,4-dioxo-4H-4lambda*6*-benzo[1,...)
Show SMILES CC1=C(Oc2ccccc2S1(=O)=O)c1ccc(OCCCN2CCCC2)cc1 |t:1|
Show InChI InChI=1S/C22H25NO4S/c1-17-22(27-20-7-2-3-8-21(20)28(17,24)25)18-9-11-19(12-10-18)26-16-6-15-23-13-4-5-14-23/h2-3,7-12H,4-6,13-16H2,1H3
Reactome pathway
n/an/a 470n/an/an/an/an/an/a
Tsukuba Research Institute
Curated by ChEMBL
Assay Description
Inhibition of [35S]MK499 binding to human ERG transfected in HEK293 cells by microscintillation counting
Bioorg Med Chem Lett 19: 4232-6 (2009)
Article DOI: 10.1016/j.bmcl.2009.05.101
BindingDB Entry DOI: 10.7270/Q20G3K69