BDBM50296371 (3S)-6-[3-(2-Thienyl)propylcarboxamido]-isochroman-3-carboxylic acid::CHEMBL570779
SMILES: OC(=O)[C@@H]1Cc2cc(NC(=O)CCCc3cccs3)ccc2CO1
InChI Key: InChIKey=PJQZUYRLSTYAAU-INIZCTEOSA-N
Data: 3 IC50
Activity Spreadsheet -- Enzyme Inhibition Constant Data from BindingDB
Found 3 hits for monomerid = 50296371
Trg + Lig
Ki
nM
ΔG°
kcal/mole
IC50
nM
Kd
nM
EC50/IC50
nM
koff
s-1
kon
M-1s-1
pHTemp
°C
Protein-tyrosine phosphatase 1B
(Homo sapiens (Human))
BDBM50296371
((3S)-6-[3-(2-Thienyl)propylcarboxamido]-isochroman...)
Show SMILES OC(=O)[C@@H]1Cc2cc(NC(=O)CCCc3cccs3)ccc2CO1 |r|
Show InChI InChI=1S/C18H19NO4S/c20-17(5-1-3-15-4-2-8-24-15)19-14-7-6-12-11-23-16(18(21)22)10-13(12)9-14/h2,4,6-9,16H,1,3,5,10-11H2,(H,19,20)(H,21,22)/t16-/m0/s1
NCI pathway
Reactome pathway
n/an/a 553n/an/an/an/an/an/a
Glenmark Research Center
Curated by ChEMBL
Assay Description
Inhibition of PTP1B
Eur J Med Chem 44: 3147-57 (2009)
Article DOI: 10.1016/j.ejmech.2009.03.009
BindingDB Entry DOI: 10.7270/Q2FJ2GTG
Receptor-type tyrosine-protein phosphatase F (LAR)
(Homo sapiens (Human))
BDBM50296371
((3S)-6-[3-(2-Thienyl)propylcarboxamido]-isochroman...)
Show SMILES OC(=O)[C@@H]1Cc2cc(NC(=O)CCCc3cccs3)ccc2CO1 |r|
Show InChI InChI=1S/C18H19NO4S/c20-17(5-1-3-15-4-2-8-24-15)19-14-7-6-12-11-23-16(18(21)22)10-13(12)9-14/h2,4,6-9,16H,1,3,5,10-11H2,(H,19,20)(H,21,22)/t16-/m0/s1
n/an/a 765n/an/an/an/an/an/a
Glenmark Research Center
Curated by ChEMBL
Assay Description
Inhibition of LAR
Eur J Med Chem 44: 3147-57 (2009)
Article DOI: 10.1016/j.ejmech.2009.03.009
BindingDB Entry DOI: 10.7270/Q2FJ2GTG
Tyrosine-protein phosphatase non-receptor type 2
(Homo sapiens (Human))
BDBM50296371
((3S)-6-[3-(2-Thienyl)propylcarboxamido]-isochroman...)
Show SMILES OC(=O)[C@@H]1Cc2cc(NC(=O)CCCc3cccs3)ccc2CO1 |r|
Show InChI InChI=1S/C18H19NO4S/c20-17(5-1-3-15-4-2-8-24-15)19-14-7-6-12-11-23-16(18(21)22)10-13(12)9-14/h2,4,6-9,16H,1,3,5,10-11H2,(H,19,20)(H,21,22)/t16-/m0/s1
n/an/a 678n/an/an/an/an/an/a
Glenmark Research Center
Curated by ChEMBL
Assay Description
Inhibition of TCPTP
Eur J Med Chem 44: 3147-57 (2009)
Article DOI: 10.1016/j.ejmech.2009.03.009
BindingDB Entry DOI: 10.7270/Q2FJ2GTG