BDBM50296378 (3S)-7-[2-(2,2-Diphenyl-1,3-dithiolan-4-yl)ethylcarboxamido]-isochroman-3-carboxylic acid::CHEMBL556913
SMILES: OC(=O)[C@@H]1Cc2ccc(NC(=O)CCC3CSC(S3)(c3ccccc3)c3ccccc3)cc2CO1
InChI Key: InChIKey=GWIDFOFQLXLIML-BBMPLOMVSA-N
Data: 3 IC50
Activity Spreadsheet -- Enzyme Inhibition Constant Data from BindingDB
Found 3 hits for monomerid = 50296378
Trg + Lig
Ki
nM
ΔG°
kcal/mole
IC50
nM
Kd
nM
EC50/IC50
nM
koff
s-1
kon
M-1s-1
pHTemp
°C
Protein-tyrosine phosphatase 1B
(Homo sapiens (Human))
BDBM50296378
((3S)-7-[2-(2,2-Diphenyl-1,3-dithiolan-4-yl)ethylca...)
Show SMILES OC(=O)[C@@H]1Cc2ccc(NC(=O)CCC3CSC(S3)(c3ccccc3)c3ccccc3)cc2CO1 |r|
Show InChI InChI=1S/C28H27NO4S2/c30-26(29-23-12-11-19-16-25(27(31)32)33-17-20(19)15-23)14-13-24-18-34-28(35-24,21-7-3-1-4-8-21)22-9-5-2-6-10-22/h1-12,15,24-25H,13-14,16-18H2,(H,29,30)(H,31,32)/t24?,25-/m0/s1
NCI pathway
Reactome pathway
n/an/a 638n/an/an/an/an/an/a
Glenmark Research Center
Curated by ChEMBL
Assay Description
Inhibition of PTP1B
Eur J Med Chem 44: 3147-57 (2009)
Article DOI: 10.1016/j.ejmech.2009.03.009
BindingDB Entry DOI: 10.7270/Q2FJ2GTG
Receptor-type tyrosine-protein phosphatase F (LAR)
(Homo sapiens (Human))
BDBM50296378
((3S)-7-[2-(2,2-Diphenyl-1,3-dithiolan-4-yl)ethylca...)
Show SMILES OC(=O)[C@@H]1Cc2ccc(NC(=O)CCC3CSC(S3)(c3ccccc3)c3ccccc3)cc2CO1 |r|
Show InChI InChI=1S/C28H27NO4S2/c30-26(29-23-12-11-19-16-25(27(31)32)33-17-20(19)15-23)14-13-24-18-34-28(35-24,21-7-3-1-4-8-21)22-9-5-2-6-10-22/h1-12,15,24-25H,13-14,16-18H2,(H,29,30)(H,31,32)/t24?,25-/m0/s1
n/an/a 5.06E+3n/an/an/an/an/an/a
Glenmark Research Center
Curated by ChEMBL
Assay Description
Inhibition of LAR
Eur J Med Chem 44: 3147-57 (2009)
Article DOI: 10.1016/j.ejmech.2009.03.009
BindingDB Entry DOI: 10.7270/Q2FJ2GTG
Tyrosine-protein phosphatase non-receptor type 2
(Homo sapiens (Human))
BDBM50296378
((3S)-7-[2-(2,2-Diphenyl-1,3-dithiolan-4-yl)ethylca...)
Show SMILES OC(=O)[C@@H]1Cc2ccc(NC(=O)CCC3CSC(S3)(c3ccccc3)c3ccccc3)cc2CO1 |r|
Show InChI InChI=1S/C28H27NO4S2/c30-26(29-23-12-11-19-16-25(27(31)32)33-17-20(19)15-23)14-13-24-18-34-28(35-24,21-7-3-1-4-8-21)22-9-5-2-6-10-22/h1-12,15,24-25H,13-14,16-18H2,(H,29,30)(H,31,32)/t24?,25-/m0/s1
n/an/a 4.86E+3n/an/an/an/an/an/a
Glenmark Research Center
Curated by ChEMBL
Assay Description
Inhibition of TCPTP
Eur J Med Chem 44: 3147-57 (2009)
Article DOI: 10.1016/j.ejmech.2009.03.009
BindingDB Entry DOI: 10.7270/Q2FJ2GTG