BDBM50296383 (3S)-6-{4-[(4S)-2-Oxoperhydrothieno-[3,4-d]imidazol-4-yl]butylcarboxamido}-isochroman-3-carboxylic acid::CHEMBL549297
SMILES: OC(=O)[C@@H]1Cc2cc(NC(=O)CCCC[C@@H]3SCC4NC(=O)NC34)ccc2CO1
InChI Key: InChIKey=BNDODEIOIJJVAR-LPMVOBIJSA-N
Data: 3 IC50
Activity Spreadsheet -- Enzyme Inhibition Constant Data from BindingDB
Found 3 hits for monomerid = 50296383
Trg + Lig
Ki
nM
ΔG°
kcal/mole
IC50
nM
Kd
nM
EC50/IC50
nM
koff
s-1
kon
M-1s-1
pHTemp
°C
Protein-tyrosine phosphatase 1B
(Homo sapiens (Human))
BDBM50296383
((3S)-6-{4-[(4S)-2-Oxoperhydrothieno-[3,4-d]imidazo...)
Show SMILES OC(=O)[C@@H]1Cc2cc(NC(=O)CCCC[C@@H]3SCC4NC(=O)NC34)ccc2CO1 |r|
Show InChI InChI=1S/C20H25N3O5S/c24-17(4-2-1-3-16-18-14(10-29-16)22-20(27)23-18)21-13-6-5-11-9-28-15(19(25)26)8-12(11)7-13/h5-7,14-16,18H,1-4,8-10H2,(H,21,24)(H,25,26)(H2,22,23,27)/t14?,15-,16-,18?/m0/s1
NCI pathway
Reactome pathway
n/an/a 2.90E+3n/an/an/an/an/an/a
Glenmark Research Center
Curated by ChEMBL
Assay Description
Inhibition of PTP1B
Eur J Med Chem 44: 3147-57 (2009)
Article DOI: 10.1016/j.ejmech.2009.03.009
BindingDB Entry DOI: 10.7270/Q2FJ2GTG
Receptor-type tyrosine-protein phosphatase F (LAR)
(Homo sapiens (Human))
BDBM50296383
((3S)-6-{4-[(4S)-2-Oxoperhydrothieno-[3,4-d]imidazo...)
Show SMILES OC(=O)[C@@H]1Cc2cc(NC(=O)CCCC[C@@H]3SCC4NC(=O)NC34)ccc2CO1 |r|
Show InChI InChI=1S/C20H25N3O5S/c24-17(4-2-1-3-16-18-14(10-29-16)22-20(27)23-18)21-13-6-5-11-9-28-15(19(25)26)8-12(11)7-13/h5-7,14-16,18H,1-4,8-10H2,(H,21,24)(H,25,26)(H2,22,23,27)/t14?,15-,16-,18?/m0/s1
n/an/a 7.05E+3n/an/an/an/an/an/a
Glenmark Research Center
Curated by ChEMBL
Assay Description
Inhibition of LAR
Eur J Med Chem 44: 3147-57 (2009)
Article DOI: 10.1016/j.ejmech.2009.03.009
BindingDB Entry DOI: 10.7270/Q2FJ2GTG
Tyrosine-protein phosphatase non-receptor type 2
(Homo sapiens (Human))
BDBM50296383
((3S)-6-{4-[(4S)-2-Oxoperhydrothieno-[3,4-d]imidazo...)
Show SMILES OC(=O)[C@@H]1Cc2cc(NC(=O)CCCC[C@@H]3SCC4NC(=O)NC34)ccc2CO1 |r|
Show InChI InChI=1S/C20H25N3O5S/c24-17(4-2-1-3-16-18-14(10-29-16)22-20(27)23-18)21-13-6-5-11-9-28-15(19(25)26)8-12(11)7-13/h5-7,14-16,18H,1-4,8-10H2,(H,21,24)(H,25,26)(H2,22,23,27)/t14?,15-,16-,18?/m0/s1
n/an/a 6.88E+3n/an/an/an/an/an/a
Glenmark Research Center
Curated by ChEMBL
Assay Description
Inhibition of TCPTP
Eur J Med Chem 44: 3147-57 (2009)
Article DOI: 10.1016/j.ejmech.2009.03.009
BindingDB Entry DOI: 10.7270/Q2FJ2GTG