BDBM50296530 CHEMBL557652::N-(5-(3,4-difluorobenzyl)thiazol-2-yl)-3-(2-hydroxyethoxy)-4-methoxybenzamide
SMILES: COc1ccc(cc1OCCO)C(=O)Nc1ncc(Cc2ccc(F)c(F)c2)s1
InChI Key: InChIKey=MPKPTRVJTRZSTE-UHFFFAOYSA-N
Data: 3 IC50
Activity Spreadsheet -- Enzyme Inhibition Constant Data from BindingDB
Found 3 hits for monomerid = 50296530
Trg + Lig
Ki
nM
ΔG°
kcal/mole
IC50
nM
Kd
nM
EC50/IC50
nM
koff
s-1
kon
M-1s-1
pHTemp
°C
Acyl-CoA desaturase 1
(Mus musculus)
BDBM50296530
(CHEMBL557652 | N-(5-(3,4-difluorobenzyl)thiazol-2-...)
Show SMILES COc1ccc(cc1OCCO)C(=O)Nc1ncc(Cc2ccc(F)c(F)c2)s1
Show InChI InChI=1S/C20H18F2N2O4S/c1-27-17-5-3-13(10-18(17)28-7-6-25)19(26)24-20-23-11-14(29-20)8-12-2-4-15(21)16(22)9-12/h2-5,9-11,25H,6-8H2,1H3,(H,23,24,26)
n/an/a 2n/an/an/an/an/an/a
Daiichi Sankyo Co., Ltd
Curated by ChEMBL
Assay Description
Inhibition of SCD1 in mouse microsomes assessed as conversion of [14C]stearate to [14C]oleate after 60 mins
Bioorg Med Chem Lett 19: 4151-8 (2009)
Article DOI: 10.1016/j.bmcl.2009.05.119
BindingDB Entry DOI: 10.7270/Q21836H1
Stearoyl-CoA desaturase
(Homo sapiens (Human))
BDBM50296530
(CHEMBL557652 | N-(5-(3,4-difluorobenzyl)thiazol-2-...)
Show SMILES COc1ccc(cc1OCCO)C(=O)Nc1ncc(Cc2ccc(F)c(F)c2)s1
Show InChI InChI=1S/C20H18F2N2O4S/c1-27-17-5-3-13(10-18(17)28-7-6-25)19(26)24-20-23-11-14(29-20)8-12-2-4-15(21)16(22)9-12/h2-5,9-11,25H,6-8H2,1H3,(H,23,24,26)
n/an/a 34n/an/an/an/an/an/a
Daiichi Sankyo Co., Ltd
Curated by ChEMBL
Assay Description
Inhibition of human SCD1 expressed in HEK293A cells assessed as conversion of [14C]stearate to [14C]oleate
Bioorg Med Chem Lett 19: 4151-8 (2009)
Article DOI: 10.1016/j.bmcl.2009.05.119
BindingDB Entry DOI: 10.7270/Q21836H1
Stearoyl-CoA desaturase
(Homo sapiens (Human))
BDBM50296530
(CHEMBL557652 | N-(5-(3,4-difluorobenzyl)thiazol-2-...)
Show SMILES COc1ccc(cc1OCCO)C(=O)Nc1ncc(Cc2ccc(F)c(F)c2)s1
Show InChI InChI=1S/C20H18F2N2O4S/c1-27-17-5-3-13(10-18(17)28-7-6-25)19(26)24-20-23-11-14(29-20)8-12-2-4-15(21)16(22)9-12/h2-5,9-11,25H,6-8H2,1H3,(H,23,24,26)
n/an/a 9n/an/an/an/an/an/a
Daiichi Sankyo Co., Ltd
Curated by ChEMBL
Assay Description
Inhibition of SCD1 in human microsomes assessed as conversion of [14C]stearate to [14C]oleate after 60 mins
Bioorg Med Chem Lett 19: 4151-8 (2009)
Article DOI: 10.1016/j.bmcl.2009.05.119
BindingDB Entry DOI: 10.7270/Q21836H1