BDBM50296611 (R)-3-(furan-3-carboxamido)-2-(2,4,6-trimethylphenylsulfonamido)propanoic acid::CHEMBL560272
SMILES: Cc1cc(C)c(c(C)c1)S(=O)(=O)N[C@H](CNC(=O)c1ccoc1)C(O)=O
InChI Key: InChIKey=ODXFIWBNVIYTGK-CQSZACIVSA-N
Data: 1 IC50
Activity Spreadsheet -- Enzyme Inhibition Constant Data from BindingDB
Found 1 hit for monomerid = 50296611
Trg + Lig
Ki
nM
ΔG°
kcal/mole
IC50
nM
Kd
nM
EC50/IC50
nM
koff
s-1
kon
M-1s-1
pHTemp
°C
Integrin alpha-V
(Homo sapiens (Human))
BDBM50296611
((R)-3-(furan-3-carboxamido)-2-(2,4,6-trimethylphen...)
Show SMILES Cc1cc(C)c(c(C)c1)S(=O)(=O)N[C@H](CNC(=O)c1ccoc1)C(O)=O |r|
Show InChI InChI=1S/C17H20N2O6S/c1-10-6-11(2)15(12(3)7-10)26(23,24)19-14(17(21)22)8-18-16(20)13-4-5-25-9-13/h4-7,9,14,19H,8H2,1-3H3,(H,18,20)(H,21,22)/t14-/m1/s1
NCI pathway
Reactome pathway
n/an/a 32n/an/an/an/an/an/a
AstraZeneca
Curated by ChEMBL
Assay Description
Inhibition of fibrinogen binding to alphavbeta3 integrin
Bioorg Med Chem Lett 19: 4832-5 (2009)
Article DOI: 10.1016/j.bmcl.2009.06.041
BindingDB Entry DOI: 10.7270/Q2CJ8DJQ