BDBM50296704 3-{4-[2-Amino-6-(4-benzyl-piperazin-1-yl)-pyrimidin-4-yloxy]-phenyl}-2-methyl-2-phenoxy-propionic acid::CHEMBL563824
SMILES: CC(Cc1ccc(Oc2cc(nc(N)n2)N2CCN(Cc3ccccc3)CC2)cc1)(Oc1ccccc1)C(O)=O
InChI Key: InChIKey=VHFPYVLKEYFCHH-UHFFFAOYSA-N
Data: 1 KI  1 IC50  1 EC50
Activity Spreadsheet -- Enzyme Inhibition Constant Data from BindingDB
Found 3 hits for monomerid = 50296704
Trg + Lig
Ki
nM
ΔG°
kcal/mole
IC50
nM
Kd
nM
EC50/IC50
nM
koff
s-1
kon
M-1s-1
pHTemp
°C
11-beta-hydroxysteroid dehydrogenase 1
(Mus musculus (mouse))
BDBM50296704
(3-{4-[2-Amino-6-(4-benzyl-piperazin-1-yl)-pyrimidi...)
Show SMILES CC(Cc1ccc(Oc2cc(nc(N)n2)N2CCN(Cc3ccccc3)CC2)cc1)(Oc1ccccc1)C(O)=O
Show InChI InChI=1S/C31H33N5O4/c1-31(29(37)38,40-26-10-6-3-7-11-26)21-23-12-14-25(15-13-23)39-28-20-27(33-30(32)34-28)36-18-16-35(17-19-36)22-24-8-4-2-5-9-24/h2-15,20H,16-19,21-22H2,1H3,(H,37,38)(H2,32,33,34)
Reactome pathway
1.00E+3n/an/an/an/an/an/an/an/a
Chinese Academy of Sciences
Curated by ChEMBL
Assay Description
Inhibition of mouse liver microsome 11betaHSD1 reductase activity expressed in HEK293 cells by scintillation proximity assay
Bioorg Med Chem 17: 5722-32 (2009)
Article DOI: 10.1016/j.bmc.2009.05.082
BindingDB Entry DOI: 10.7270/Q2571CZ2
Peroxisome proliferator-activated receptor
(Homo sapiens (Human))
BDBM50296704
(3-{4-[2-Amino-6-(4-benzyl-piperazin-1-yl)-pyrimidi...)
Show SMILES CC(Cc1ccc(Oc2cc(nc(N)n2)N2CCN(Cc3ccccc3)CC2)cc1)(Oc1ccccc1)C(O)=O
Show InChI InChI=1S/C31H33N5O4/c1-31(29(37)38,40-26-10-6-3-7-11-26)21-23-12-14-25(15-13-23)39-28-20-27(33-30(32)34-28)36-18-16-35(17-19-36)22-24-8-4-2-5-9-24/h2-15,20H,16-19,21-22H2,1H3,(H,37,38)(H2,32,33,34)
NCI pathway
Reactome pathway
n/an/an/an/a 6.62E+3n/an/an/an/a
Chinese Academy of Sciences
Curated by ChEMBL
Assay Description
Agonist activity at human PPARgamma expressed in U2OS cells by luciferase transactivation assay
Bioorg Med Chem 17: 5722-32 (2009)
Article DOI: 10.1016/j.bmc.2009.05.082
BindingDB Entry DOI: 10.7270/Q2571CZ2
11-beta-hydroxysteroid dehydrogenase 1
(Mus musculus (mouse))
BDBM50296704
(3-{4-[2-Amino-6-(4-benzyl-piperazin-1-yl)-pyrimidi...)
Show SMILES CC(Cc1ccc(Oc2cc(nc(N)n2)N2CCN(Cc3ccccc3)CC2)cc1)(Oc1ccccc1)C(O)=O
Show InChI InChI=1S/C31H33N5O4/c1-31(29(37)38,40-26-10-6-3-7-11-26)21-23-12-14-25(15-13-23)39-28-20-27(33-30(32)34-28)36-18-16-35(17-19-36)22-24-8-4-2-5-9-24/h2-15,20H,16-19,21-22H2,1H3,(H,37,38)(H2,32,33,34)
Reactome pathway
n/an/a 710n/an/an/an/an/an/a
Chinese Academy of Sciences
Curated by ChEMBL
Assay Description
Inhibition of mouse liver microsome 11betaHSD1 expressed in HEK293 cells assessed as conversion of [3H]cortisone into [3H]cortisol by scintillation p...
Bioorg Med Chem 17: 5722-32 (2009)
Article DOI: 10.1016/j.bmc.2009.05.082
BindingDB Entry DOI: 10.7270/Q2571CZ2