BDBM50296729 4-fluorophenyl 1,4-diazabicyclo[3.2.2]nonane-4-carboxylate::CHEMBL559599
SMILES: Fc1ccc(OC(=O)N2CCN3CCC2CC3)cc1
InChI Key: InChIKey=UIEUWYVLTWWADX-UHFFFAOYSA-N
Data: 1 KI  1 IC50
Activity Spreadsheet -- Enzyme Inhibition Constant Data from BindingDB
Found 2 hits for monomerid = 50296729
Trg + Lig
Ki
nM
ΔG°
kcal/mole
IC50
nM
Kd
nM
EC50/IC50
nM
koff
s-1
kon
M-1s-1
pHTemp
°C
Neuronal acetylcholine receptor
(Rattus norvegicus (Rat))
BDBM50296729
(4-fluorophenyl 1,4-diazabicyclo[3.2.2]nonane-4-car...)
Show SMILES Fc1ccc(OC(=O)N2CCN3CCC2CC3)cc1 |TLB:6:8:13.12:15.16,(12,-37.68,;10.82,-38.68,;11.09,-40.2,;9.91,-41.19,;8.46,-40.66,;7.28,-41.66,;5.83,-41.13,;5.56,-39.61,;4.65,-42.13,;5.01,-43.6,;4.01,-42.88,;2.62,-42.95,;2.55,-41.24,;3.17,-40.08,;3.23,-41.5,;1.93,-42.21,;1.63,-43.65,;8.19,-39.15,;9.36,-38.15,)|
Show InChI InChI=1S/C14H17FN2O2/c15-11-1-3-13(4-2-11)19-14(18)17-10-9-16-7-5-12(17)6-8-16/h1-4,12H,5-10H2
Reactome pathway
537n/an/an/an/an/an/an/an/a
Pfizer Global Research& Development
Curated by ChEMBL
Assay Description
Displacement of [125I]BTX from rat alpha7 nAChR expressed in rat GH4C1 cells
Bioorg Med Chem Lett 19: 4747-51 (2009)
Article DOI: 10.1016/j.bmcl.2009.06.059
BindingDB Entry DOI: 10.7270/Q21G0N69
Neuronal acetylcholine receptor
(Rattus norvegicus (Rat))
BDBM50296729
(4-fluorophenyl 1,4-diazabicyclo[3.2.2]nonane-4-car...)
Show SMILES Fc1ccc(OC(=O)N2CCN3CCC2CC3)cc1 |TLB:6:8:13.12:15.16,(12,-37.68,;10.82,-38.68,;11.09,-40.2,;9.91,-41.19,;8.46,-40.66,;7.28,-41.66,;5.83,-41.13,;5.56,-39.61,;4.65,-42.13,;5.01,-43.6,;4.01,-42.88,;2.62,-42.95,;2.55,-41.24,;3.17,-40.08,;3.23,-41.5,;1.93,-42.21,;1.63,-43.65,;8.19,-39.15,;9.36,-38.15,)|
Show InChI InChI=1S/C14H17FN2O2/c15-11-1-3-13(4-2-11)19-14(18)17-10-9-16-7-5-12(17)6-8-16/h1-4,12H,5-10H2
n/an/a 1.78E+3n/an/an/an/an/an/a
Pfizer Global Research& Development
Curated by ChEMBL
Assay Description
Displacement of L-[3H]Nicotine from alpha4beta2 nAChR in rat brain homogenate by rapid filtration method
Bioorg Med Chem Lett 19: 4747-51 (2009)
Article DOI: 10.1016/j.bmcl.2009.06.059
BindingDB Entry DOI: 10.7270/Q21G0N69