BDBM50296744 4-bromo-3-methylphenyl 1,4-diazabicyclo[3.2.2]nonane-4-carboxylate::CHEMBL551330
SMILES: Cc1cc(OC(=O)N2CCN3CCC2CC3)ccc1Br
InChI Key: InChIKey=PVGRYELUCCPKOT-UHFFFAOYSA-N
Data: 1 KI  2 IC50
Activity Spreadsheet -- Enzyme Inhibition Constant Data from BindingDB
Found 3 hits for monomerid = 50296744
Trg + Lig
Ki
nM
ΔG°
kcal/mole
IC50
nM
Kd
nM
EC50/IC50
nM
koff
s-1
kon
M-1s-1
pHTemp
°C
Neuronal acetylcholine receptor
(Rattus norvegicus (Rat))
BDBM50296744
(4-bromo-3-methylphenyl 1,4-diazabicyclo[3.2.2]nona...)
Show SMILES Cc1cc(OC(=O)N2CCN3CCC2CC3)ccc1Br |TLB:5:7:12.11:14.15,(25.56,-5.32,;24.16,-4.82,;22.98,-5.81,;21.53,-5.28,;20.35,-6.28,;18.89,-5.75,;18.62,-4.22,;17.71,-6.74,;18.08,-8.22,;17.08,-7.5,;15.69,-7.57,;15.61,-5.86,;16.23,-4.7,;16.3,-6.12,;15,-6.83,;14.7,-8.27,;21.26,-3.76,;22.43,-2.77,;23.89,-3.29,;25.02,-2.34,)|
Show InChI InChI=1S/C15H19BrN2O2/c1-11-10-13(2-3-14(11)16)20-15(19)18-9-8-17-6-4-12(18)5-7-17/h2-3,10,12H,4-9H2,1H3
Reactome pathway
50n/an/an/an/an/an/an/an/a
Pfizer Global Research& Development
Curated by ChEMBL
Assay Description
Displacement of [125I]BTX from rat alpha7 nAChR expressed in rat GH4C1 cells
Bioorg Med Chem Lett 19: 4747-51 (2009)
Article DOI: 10.1016/j.bmcl.2009.06.059
BindingDB Entry DOI: 10.7270/Q21G0N69
Cholinergic, Nicotinic Alpha3Beta2
(Homo sapiens (Human))
BDBM50296744
(4-bromo-3-methylphenyl 1,4-diazabicyclo[3.2.2]nona...)
Show SMILES Cc1cc(OC(=O)N2CCN3CCC2CC3)ccc1Br |TLB:5:7:12.11:14.15,(25.56,-5.32,;24.16,-4.82,;22.98,-5.81,;21.53,-5.28,;20.35,-6.28,;18.89,-5.75,;18.62,-4.22,;17.71,-6.74,;18.08,-8.22,;17.08,-7.5,;15.69,-7.57,;15.61,-5.86,;16.23,-4.7,;16.3,-6.12,;15,-6.83,;14.7,-8.27,;21.26,-3.76,;22.43,-2.77,;23.89,-3.29,;25.02,-2.34,)|
Show InChI InChI=1S/C15H19BrN2O2/c1-11-10-13(2-3-14(11)16)20-15(19)18-9-8-17-6-4-12(18)5-7-17/h2-3,10,12H,4-9H2,1H3
n/an/a 4.02E+3n/an/an/an/an/an/a
Pfizer Global Research& Development
Curated by ChEMBL
Assay Description
Displacement of [3H]epibatidine from alpha3 nAChR in human IMR32 cells
Bioorg Med Chem Lett 19: 4747-51 (2009)
Article DOI: 10.1016/j.bmcl.2009.06.059
BindingDB Entry DOI: 10.7270/Q21G0N69
Neuronal acetylcholine receptor
(Rattus norvegicus (Rat))
BDBM50296744
(4-bromo-3-methylphenyl 1,4-diazabicyclo[3.2.2]nona...)
Show SMILES Cc1cc(OC(=O)N2CCN3CCC2CC3)ccc1Br |TLB:5:7:12.11:14.15,(25.56,-5.32,;24.16,-4.82,;22.98,-5.81,;21.53,-5.28,;20.35,-6.28,;18.89,-5.75,;18.62,-4.22,;17.71,-6.74,;18.08,-8.22,;17.08,-7.5,;15.69,-7.57,;15.61,-5.86,;16.23,-4.7,;16.3,-6.12,;15,-6.83,;14.7,-8.27,;21.26,-3.76,;22.43,-2.77,;23.89,-3.29,;25.02,-2.34,)|
Show InChI InChI=1S/C15H19BrN2O2/c1-11-10-13(2-3-14(11)16)20-15(19)18-9-8-17-6-4-12(18)5-7-17/h2-3,10,12H,4-9H2,1H3
n/an/a 7.22E+3n/an/an/an/an/an/a
Pfizer Global Research& Development
Curated by ChEMBL
Assay Description
Displacement of L-[3H]Nicotine from alpha4beta2 nAChR in rat brain homogenate by rapid filtration method
Bioorg Med Chem Lett 19: 4747-51 (2009)
Article DOI: 10.1016/j.bmcl.2009.06.059
BindingDB Entry DOI: 10.7270/Q21G0N69