BDBM50296882 (1-((1R,4R)-4-((R)-1-(4-fluorophenyl)ethylamino)-2,2-dimethylcyclohexanecarbonyl)-4-phenylpiperidin-4-yl)(pyrrolidin-1-yl)methanone::CHEMBL549917
SMILES: C[C@@H](N[C@@H]1CC[C@@H](C(=O)N2CCC(CC2)(C(=O)N2CCCC2)c2ccccc2)C(C)(C)C1)c1ccc(F)cc1
InChI Key: InChIKey=GVAXSJYBNRKJRZ-USOMCTOXSA-N
Data: 1 KI  2 IC50
Activity Spreadsheet -- Enzyme Inhibition Constant Data from BindingDB
Found 3 hits for monomerid = 50296882
Trg + Lig
Ki
nM
ΔG°
kcal/mole
IC50
nM
Kd
nM
EC50/IC50
nM
koff
s-1
kon
M-1s-1
pHTemp
°C
Neuropeptide Y receptor type 1
(Homo sapiens (Human))
BDBM50296882
((1-((1R,4R)-4-((R)-1-(4-fluorophenyl)ethylamino)-2...)
Show SMILES C[C@@H](N[C@@H]1CC[C@@H](C(=O)N2CCC(CC2)(C(=O)N2CCCC2)c2ccccc2)C(C)(C)C1)c1ccc(F)cc1 |r|
Show InChI InChI=1S/C33H44FN3O2/c1-24(25-11-13-27(34)14-12-25)35-28-15-16-29(32(2,3)23-28)30(38)36-21-17-33(18-22-36,26-9-5-4-6-10-26)31(39)37-19-7-8-20-37/h4-6,9-14,24,28-29,35H,7-8,15-23H2,1-3H3/t24-,28-,29+/m1/s1
Reactome pathway
44n/an/an/an/an/an/an/an/a
Tsukuba Research Institute
Curated by ChEMBL
Assay Description
Displacement of [125I]PYY from human recombinant neuropeptide Y1 receptor expressed in CHO (NFAT-bla) cells by scintillation counting
Bioorg Med Chem Lett 19: 4781-5 (2009)
Article DOI: 10.1016/j.bmcl.2009.06.050
BindingDB Entry DOI: 10.7270/Q2319VXR
Potassium voltage-gated channel subfamily H member 2
(Homo sapiens (Human))
BDBM50296882
((1-((1R,4R)-4-((R)-1-(4-fluorophenyl)ethylamino)-2...)
Show SMILES C[C@@H](N[C@@H]1CC[C@@H](C(=O)N2CCC(CC2)(C(=O)N2CCCC2)c2ccccc2)C(C)(C)C1)c1ccc(F)cc1 |r|
Show InChI InChI=1S/C33H44FN3O2/c1-24(25-11-13-27(34)14-12-25)35-28-15-16-29(32(2,3)23-28)30(38)36-21-17-33(18-22-36,26-9-5-4-6-10-26)31(39)37-19-7-8-20-37/h4-6,9-14,24,28-29,35H,7-8,15-23H2,1-3H3/t24-,28-,29+/m1/s1
Reactome pathway
n/an/a>1.00E+4n/an/an/an/an/an/a
Tsukuba Research Institute
Curated by ChEMBL
Assay Description
Displacement of [35S]MK499 from human ERG potassium channel expressed in HEK293 cells
Bioorg Med Chem Lett 19: 4781-5 (2009)
Article DOI: 10.1016/j.bmcl.2009.06.050
BindingDB Entry DOI: 10.7270/Q2319VXR
Sodium-dependent serotonin transporter
(Homo sapiens (Human))
BDBM50296882
((1-((1R,4R)-4-((R)-1-(4-fluorophenyl)ethylamino)-2...)
Show SMILES C[C@@H](N[C@@H]1CC[C@@H](C(=O)N2CCC(CC2)(C(=O)N2CCCC2)c2ccccc2)C(C)(C)C1)c1ccc(F)cc1 |r|
Show InChI InChI=1S/C33H44FN3O2/c1-24(25-11-13-27(34)14-12-25)35-28-15-16-29(32(2,3)23-28)30(38)36-21-17-33(18-22-36,26-9-5-4-6-10-26)31(39)37-19-7-8-20-37/h4-6,9-14,24,28-29,35H,7-8,15-23H2,1-3H3/t24-,28-,29+/m1/s1
n/an/a 130n/an/an/an/an/an/a
Tsukuba Research Institute
Curated by ChEMBL
Assay Description
Displacement of [3H]imipramine from human serotonin transporter expressed in CHO cell membrane by scintillation counting
Bioorg Med Chem Lett 19: 4781-5 (2009)
Article DOI: 10.1016/j.bmcl.2009.06.050
BindingDB Entry DOI: 10.7270/Q2319VXR