null
SMILES: COc1ccc(cc1)[C@@H](C)N[C@@H]1CC[C@@H](C(=O)N2CCC(CC2)(c2nnc(C)o2)c2ccccc2)C(C)(C)C1
InChI Key: InChIKey=HJHRUMZQSNPUKZ-QIDLSXJSSA-N
Activity Spreadsheet -- Enzyme Inhibition Constant Data from BindingDB
Found 2 hits for monomerid = 50296894
Trg + Lig
Ki
nM
ΔG°
kcal/mole
IC50
nM
Kd
nM
EC50/IC50
nM
koff
s-1
kon
M-1s-1
pHTemp
°C
Neuropeptide Y receptor type 1
(Homo sapiens (Human))
BDBM50296894
(((1R,4R)-4-((R)-1-(4-methoxyphenyl)ethylamino)-2,2...)
Show SMILES COc1ccc(cc1)[C@@H](C)N[C@@H]1CC[C@@H](C(=O)N2CCC(CC2)(c2nnc(C)o2)c2ccccc2)C(C)(C)C1 |r|
Show InChI InChI=1S/C32H42N4O3/c1-22(24-11-14-27(38-5)15-12-24)33-26-13-16-28(31(3,4)21-26)29(37)36-19-17-32(18-20-36,25-9-7-6-8-10-25)30-35-34-23(2)39-30/h6-12,14-15,22,26,28,33H,13,16-21H2,1-5H3/t22-,26-,28+/m1/s1
Reactome pathway
120n/an/an/an/an/an/an/an/a
Tsukuba Research Institute
Curated by ChEMBL
Assay Description
Displacement of [125I]PYY from human recombinant neuropeptide Y1 receptor expressed in CHO (NFAT-bla) cells by scintillation counting
Bioorg Med Chem Lett 19: 4781-5 (2009)
Article DOI: 10.1016/j.bmcl.2009.06.050
BindingDB Entry DOI: 10.7270/Q2319VXR
Potassium voltage-gated channel subfamily H member 2
(Homo sapiens (Human))
BDBM50296894
(((1R,4R)-4-((R)-1-(4-methoxyphenyl)ethylamino)-2,2...)
Show SMILES COc1ccc(cc1)[C@@H](C)N[C@@H]1CC[C@@H](C(=O)N2CCC(CC2)(c2nnc(C)o2)c2ccccc2)C(C)(C)C1 |r|
Show InChI InChI=1S/C32H42N4O3/c1-22(24-11-14-27(38-5)15-12-24)33-26-13-16-28(31(3,4)21-26)29(37)36-19-17-32(18-20-36,25-9-7-6-8-10-25)30-35-34-23(2)39-30/h6-12,14-15,22,26,28,33H,13,16-21H2,1-5H3/t22-,26-,28+/m1/s1
Reactome pathway
n/an/a>1.00E+4n/an/an/an/an/an/a
Tsukuba Research Institute
Curated by ChEMBL
Assay Description
Displacement of [35S]MK499 from human ERG potassium channel expressed in HEK293 cells
Bioorg Med Chem Lett 19: 4781-5 (2009)
Article DOI: 10.1016/j.bmcl.2009.06.050
BindingDB Entry DOI: 10.7270/Q2319VXR