null
SMILES: COc1ccc(cc1)[C@@H](C)N[C@@H]1CC[C@@H](C(=O)N2CCC(CC2)(c2nnco2)c2ccccc2)C(C)(C)C1
InChI Key: InChIKey=UBYUNVBXEJWFMM-JBBQQGGESA-N
Activity Spreadsheet -- Enzyme Inhibition Constant Data from BindingDB
Found 2 hits for monomerid = 50296895
Trg + Lig
Ki
nM
ΔG°
kcal/mole
IC50
nM
Kd
nM
EC50/IC50
nM
koff
s-1
kon
M-1s-1
pHTemp
°C
Neuropeptide Y receptor type 1
(Homo sapiens (Human))
BDBM50296895
((4-(1,3,4-oxadiazol-2-yl)-4-phenylpiperidin-1-yl)(...)
Show SMILES COc1ccc(cc1)[C@@H](C)N[C@@H]1CC[C@@H](C(=O)N2CCC(CC2)(c2nnco2)c2ccccc2)C(C)(C)C1 |r|
Show InChI InChI=1S/C31H40N4O3/c1-22(23-10-13-26(37-4)14-11-23)33-25-12-15-27(30(2,3)20-25)28(36)35-18-16-31(17-19-35,29-34-32-21-38-29)24-8-6-5-7-9-24/h5-11,13-14,21-22,25,27,33H,12,15-20H2,1-4H3/t22-,25-,27+/m1/s1
Reactome pathway
890n/an/an/an/an/an/an/an/a
Tsukuba Research Institute
Curated by ChEMBL
Assay Description
Displacement of [125I]PYY from human recombinant neuropeptide Y1 receptor expressed in CHO (NFAT-bla) cells by scintillation counting
Bioorg Med Chem Lett 19: 4781-5 (2009)
Article DOI: 10.1016/j.bmcl.2009.06.050
BindingDB Entry DOI: 10.7270/Q2319VXR
Potassium voltage-gated channel subfamily H member 2
(Homo sapiens (Human))
BDBM50296895
((4-(1,3,4-oxadiazol-2-yl)-4-phenylpiperidin-1-yl)(...)
Show SMILES COc1ccc(cc1)[C@@H](C)N[C@@H]1CC[C@@H](C(=O)N2CCC(CC2)(c2nnco2)c2ccccc2)C(C)(C)C1 |r|
Show InChI InChI=1S/C31H40N4O3/c1-22(23-10-13-26(37-4)14-11-23)33-25-12-15-27(30(2,3)20-25)28(36)35-18-16-31(17-19-35,29-34-32-21-38-29)24-8-6-5-7-9-24/h5-11,13-14,21-22,25,27,33H,12,15-20H2,1-4H3/t22-,25-,27+/m1/s1
Reactome pathway
n/an/a>1.00E+4n/an/an/an/an/an/a
Tsukuba Research Institute
Curated by ChEMBL
Assay Description
Displacement of [35S]MK499 from human ERG potassium channel expressed in HEK293 cells
Bioorg Med Chem Lett 19: 4781-5 (2009)
Article DOI: 10.1016/j.bmcl.2009.06.050
BindingDB Entry DOI: 10.7270/Q2319VXR