BDBM50296969 4-((1H-imidazol-1-yl)methyl)phenyl 4-methylbenzenesulfonate::CHEMBL539453
SMILES: Cc1ccc(cc1)S(=O)(=O)Oc1ccc(Cn2ccnc2)cc1
InChI Key: InChIKey=KBPIPTVHZGVQAP-UHFFFAOYSA-N
Data: 4 IC50
Activity Spreadsheet -- Enzyme Inhibition Constant Data from BindingDB
Found 4 hits for monomerid = 50296969
Trg + Lig
Ki
nM
ΔG°
kcal/mole
IC50
nM
Kd
nM
EC50/IC50
nM
koff
s-1
kon
M-1s-1
pHTemp
°C
Cytochrome P450 17A1
(Rattus norvegicus (Rat))
BDBM50296969
(4-((1H-imidazol-1-yl)methyl)phenyl 4-methylbenzene...)
Show SMILES Cc1ccc(cc1)S(=O)(=O)Oc1ccc(Cn2ccnc2)cc1
Show InChI InChI=1S/C17H16N2O3S/c1-14-2-8-17(9-3-14)23(20,21)22-16-6-4-15(5-7-16)12-19-11-10-18-13-19/h2-11,13H,12H2,1H3
n/an/a 2.52E+4n/an/an/an/an/an/a
University of the West of Scotland
Curated by ChEMBL
Assay Description
Inhibition of 17alpha-hydroxylase activity of rat testicular microsomal P450-17alpha
Bioorg Med Chem Lett 19: 4698-701 (2009)
Article DOI: 10.1016/j.bmcl.2009.06.070
BindingDB Entry DOI: 10.7270/Q29K4B72
Cytochrome P450 17A1
(Rattus norvegicus (Rat))
BDBM50296969
(4-((1H-imidazol-1-yl)methyl)phenyl 4-methylbenzene...)
Show SMILES Cc1ccc(cc1)S(=O)(=O)Oc1ccc(Cn2ccnc2)cc1
Show InChI InChI=1S/C17H16N2O3S/c1-14-2-8-17(9-3-14)23(20,21)22-16-6-4-15(5-7-16)12-19-11-10-18-13-19/h2-11,13H,12H2,1H3
n/an/a 30n/an/an/an/an/an/a
University of the West of Scotland
Curated by ChEMBL
Assay Description
Inhibition of 17,20-lyase activity of rat testicular microsomal P450-17alpha
Bioorg Med Chem Lett 20: 5345-8 (2010)
Article DOI: 10.1016/j.bmcl.2010.02.100
BindingDB Entry DOI: 10.7270/Q2DF6RF1
Cytochrome P450 17A1
(Rattus norvegicus (Rat))
BDBM50296969
(4-((1H-imidazol-1-yl)methyl)phenyl 4-methylbenzene...)
Show SMILES Cc1ccc(cc1)S(=O)(=O)Oc1ccc(Cn2ccnc2)cc1
Show InChI InChI=1S/C17H16N2O3S/c1-14-2-8-17(9-3-14)23(20,21)22-16-6-4-15(5-7-16)12-19-11-10-18-13-19/h2-11,13H,12H2,1H3
n/an/a 40n/an/an/an/an/an/a
University of the West of Scotland
Curated by ChEMBL
Assay Description
Inhibition of 17alpha-hydroxylase activity of rat testicular microsomal P450-17alpha
Bioorg Med Chem Lett 20: 5345-8 (2010)
Article DOI: 10.1016/j.bmcl.2010.02.100
BindingDB Entry DOI: 10.7270/Q2DF6RF1
Cytochrome P450 17A1
(Rattus norvegicus (Rat))
BDBM50296969
(4-((1H-imidazol-1-yl)methyl)phenyl 4-methylbenzene...)
Show SMILES Cc1ccc(cc1)S(=O)(=O)Oc1ccc(Cn2ccnc2)cc1
Show InChI InChI=1S/C17H16N2O3S/c1-14-2-8-17(9-3-14)23(20,21)22-16-6-4-15(5-7-16)12-19-11-10-18-13-19/h2-11,13H,12H2,1H3
n/an/a 230n/an/an/an/an/an/a
University of the West of Scotland
Curated by ChEMBL
Assay Description
Inhibition of 17,20-lyase activity of rat testicular microsomal P450-17alpha
Bioorg Med Chem Lett 19: 4698-701 (2009)
Article DOI: 10.1016/j.bmcl.2009.06.070
BindingDB Entry DOI: 10.7270/Q29K4B72