BDBM50297337 CHEMBL557257::N,N-Diethyl-2-methyl-4-(spiro[chromene-2,4'-piperidine]-4-yl)-benzamide
SMILES: CCN(CC)C(=O)c1ccc(cc1C)C1=CC2(CCNCC2)Oc2ccccc12
InChI Key: InChIKey=WNCQWOMFQNVVTP-UHFFFAOYSA-N
Data: 1 KI  2 IC50  1 EC50
Activity Spreadsheet -- Enzyme Inhibition Constant Data from BindingDB
Found 4 hits for monomerid = 50297337
Trg + Lig
Ki
nM
ΔG°
kcal/mole
IC50
nM
Kd
nM
EC50/IC50
nM
koff
s-1
kon
M-1s-1
pHTemp
°C
Delta-type opioid receptor
(Homo sapiens (Human))
BDBM50297337
(CHEMBL557257 | N,N-Diethyl-2-methyl-4-(spiro[chrom...)
Show SMILES CCN(CC)C(=O)c1ccc(cc1C)C1=CC2(CCNCC2)Oc2ccccc12 |t:15|
Show InChI InChI=1S/C25H30N2O2/c1-4-27(5-2)24(28)20-11-10-19(16-18(20)3)22-17-25(12-14-26-15-13-25)29-23-9-7-6-8-21(22)23/h6-11,16-17,26H,4-5,12-15H2,1-3H3
Reactome pathway
3.30n/an/an/an/an/an/an/an/a
Adolor Corporation
Curated by ChEMBL
Assay Description
Displacement of [3H]diprenorphine from human delta opioid receptor expressed in CHO cells
J Med Chem 52: 5685-702 (2009)
Article DOI: 10.1021/jm900773n
BindingDB Entry DOI: 10.7270/Q2VD6ZH3
Potassium voltage-gated channel subfamily H member 2
(Homo sapiens (Human))
BDBM50297337
(CHEMBL557257 | N,N-Diethyl-2-methyl-4-(spiro[chrom...)
Show SMILES CCN(CC)C(=O)c1ccc(cc1C)C1=CC2(CCNCC2)Oc2ccccc12 |t:15|
Show InChI InChI=1S/C25H30N2O2/c1-4-27(5-2)24(28)20-11-10-19(16-18(20)3)22-17-25(12-14-26-15-13-25)29-23-9-7-6-8-21(22)23/h6-11,16-17,26H,4-5,12-15H2,1-3H3
Reactome pathway
n/an/a 4.49E+3n/an/an/an/an/an/a
Adolor Corporation
Curated by ChEMBL
Assay Description
Inhibition of human ERG channel expressed in HEK293 cells by voltage clamp assay
J Med Chem 52: 5685-702 (2009)
Article DOI: 10.1021/jm900773n
BindingDB Entry DOI: 10.7270/Q2VD6ZH3
Cytochrome P450 2D6
(Homo sapiens (Human))
BDBM50297337
(CHEMBL557257 | N,N-Diethyl-2-methyl-4-(spiro[chrom...)
Show SMILES CCN(CC)C(=O)c1ccc(cc1C)C1=CC2(CCNCC2)Oc2ccccc12 |t:15|
Show InChI InChI=1S/C25H30N2O2/c1-4-27(5-2)24(28)20-11-10-19(16-18(20)3)22-17-25(12-14-26-15-13-25)29-23-9-7-6-8-21(22)23/h6-11,16-17,26H,4-5,12-15H2,1-3H3
n/an/a 9.50E+3n/an/an/an/an/an/a
Adolor Corporation
Curated by ChEMBL
Assay Description
Inhibition of human CYP2D6 by fluorescence-based assay
J Med Chem 52: 5685-702 (2009)
Article DOI: 10.1021/jm900773n
BindingDB Entry DOI: 10.7270/Q2VD6ZH3
Delta-type opioid receptor
(Homo sapiens (Human))
BDBM50297337
(CHEMBL557257 | N,N-Diethyl-2-methyl-4-(spiro[chrom...)
Show SMILES CCN(CC)C(=O)c1ccc(cc1C)C1=CC2(CCNCC2)Oc2ccccc12 |t:15|
Show InChI InChI=1S/C25H30N2O2/c1-4-27(5-2)24(28)20-11-10-19(16-18(20)3)22-17-25(12-14-26-15-13-25)29-23-9-7-6-8-21(22)23/h6-11,16-17,26H,4-5,12-15H2,1-3H3
Reactome pathway
n/an/an/an/a 310n/an/an/an/a
Adolor Corporation
Curated by ChEMBL
Assay Description
Agonist activity at human delta opioid receptor expressed in CHO cells assessed as stimulation of [35S]GTPgammaS binding
J Med Chem 52: 5685-702 (2009)
Article DOI: 10.1021/jm900773n
BindingDB Entry DOI: 10.7270/Q2VD6ZH3