null
SMILES: CS(=O)(=O)c1ccc(cc1)-c1cc(OCC(F)(F)F)nc(NC2CCCCC2)n1
InChI Key: InChIKey=DRPHXFXXVMZXSP-UHFFFAOYSA-N
Activity Spreadsheet -- Enzyme Inhibition Constant Data from BindingDB
Found 2 hits for monomerid = 50297661
Trg + Lig
Ki
nM
ΔG°
kcal/mole
IC50
nM
Kd
nM
EC50/IC50
nM
koff
s-1
kon
M-1s-1
pHTemp
°C
Prostaglandin G/H synthase 2
(Homo sapiens (Human))
BDBM50297661
(CHEMBL560284 | N-cyclohexyl-4-(4-(methylsulfonyl)p...)
Show SMILES CS(=O)(=O)c1ccc(cc1)-c1cc(OCC(F)(F)F)nc(NC2CCCCC2)n1
Show InChI InChI=1S/C19H22F3N3O3S/c1-29(26,27)15-9-7-13(8-10-15)16-11-17(28-12-19(20,21)22)25-18(24-16)23-14-5-3-2-4-6-14/h7-11,14H,2-6,12H2,1H3,(H,23,24,25)
NCI pathway
Reactome pathway
n/an/a 16n/an/an/an/an/an/a
GlaxoSmithKline
Curated by ChEMBL
Assay Description
Inhibition of human COX2 expressed in baculovirus-infected SF9 cells assessed as inhibition of arachidonic acid-stimulated PGE2 production treated 1 ...
Bioorg Med Chem Lett 19: 4504-8 (2009)
Article DOI: 10.1016/j.bmcl.2009.02.085
BindingDB Entry DOI: 10.7270/Q20Z7396
Prostaglandin G/H synthase 1
(Homo sapiens (Human))
BDBM50297661
(CHEMBL560284 | N-cyclohexyl-4-(4-(methylsulfonyl)p...)
Show SMILES CS(=O)(=O)c1ccc(cc1)-c1cc(OCC(F)(F)F)nc(NC2CCCCC2)n1
Show InChI InChI=1S/C19H22F3N3O3S/c1-29(26,27)15-9-7-13(8-10-15)16-11-17(28-12-19(20,21)22)25-18(24-16)23-14-5-3-2-4-6-14/h7-11,14H,2-6,12H2,1H3,(H,23,24,25)
n/an/a 6.32E+3n/an/an/an/an/an/a
GlaxoSmithKline
Curated by ChEMBL
Assay Description
Inhibition of human COX1 expressed in african green monkey COS cells assessed as inhibition of arachidonic acid-stimulated PGE2 treated 1 hr before a...
Bioorg Med Chem Lett 19: 4504-8 (2009)
Article DOI: 10.1016/j.bmcl.2009.02.085
BindingDB Entry DOI: 10.7270/Q20Z7396