BDBM50297664 CHEMBL559613::N-methyl-4-(4-(methylsulfonyl)phenyl)-N-p-tolyl-6-(trifluoromethyl)pyrimidin-2-amine
SMILES: CN(c1ccc(C)cc1)c1nc(cc(n1)C(F)(F)F)-c1ccc(cc1)S(C)(=O)=O
InChI Key: InChIKey=YSGYFZBBGKJFAX-UHFFFAOYSA-N
Data: 2 IC50
Activity Spreadsheet -- Enzyme Inhibition Constant Data from BindingDB
Found 2 hits for monomerid = 50297664
Trg + Lig
Ki
nM
ΔG°
kcal/mole
IC50
nM
Kd
nM
EC50/IC50
nM
koff
s-1
kon
M-1s-1
pHTemp
°C
Prostaglandin G/H synthase 2
(Homo sapiens (Human))
BDBM50297664
(CHEMBL559613 | N-methyl-4-(4-(methylsulfonyl)pheny...)
Show SMILES CN(c1ccc(C)cc1)c1nc(cc(n1)C(F)(F)F)-c1ccc(cc1)S(C)(=O)=O
Show InChI InChI=1S/C20H18F3N3O2S/c1-13-4-8-15(9-5-13)26(2)19-24-17(12-18(25-19)20(21,22)23)14-6-10-16(11-7-14)29(3,27)28/h4-12H,1-3H3
NCI pathway
Reactome pathway
n/an/a 3n/an/an/an/an/an/a
GlaxoSmithKline
Curated by ChEMBL
Assay Description
Inhibition of human COX2 expressed in baculovirus-infected SF9 cells assessed as inhibition of arachidonic acid-stimulated PGE2 production treated 1 ...
Bioorg Med Chem Lett 19: 4504-8 (2009)
Article DOI: 10.1016/j.bmcl.2009.02.085
BindingDB Entry DOI: 10.7270/Q20Z7396
Prostaglandin G/H synthase 1
(Homo sapiens (Human))
BDBM50297664
(CHEMBL559613 | N-methyl-4-(4-(methylsulfonyl)pheny...)
Show SMILES CN(c1ccc(C)cc1)c1nc(cc(n1)C(F)(F)F)-c1ccc(cc1)S(C)(=O)=O
Show InChI InChI=1S/C20H18F3N3O2S/c1-13-4-8-15(9-5-13)26(2)19-24-17(12-18(25-19)20(21,22)23)14-6-10-16(11-7-14)29(3,27)28/h4-12H,1-3H3
n/an/a>7.42E+4n/an/an/an/an/an/a
GlaxoSmithKline
Curated by ChEMBL
Assay Description
Inhibition of human COX1 expressed in african green monkey COS cells assessed as inhibition of arachidonic acid-stimulated PGE2 treated 1 hr before a...
Bioorg Med Chem Lett 19: 4504-8 (2009)
Article DOI: 10.1016/j.bmcl.2009.02.085
BindingDB Entry DOI: 10.7270/Q20Z7396