BDBM50297668 4-(2-(cyclohexylamino)-6-(trifluoromethyl)pyrimidin-4-yl)benzenesulfonamide::CHEMBL561609
SMILES: NS(=O)(=O)c1ccc(cc1)-c1cc(nc(NC2CCCCC2)n1)C(F)(F)F
InChI Key: InChIKey=HXAMHEIGBVROQA-UHFFFAOYSA-N
Data: 2 IC50
Activity Spreadsheet -- Enzyme Inhibition Constant Data from BindingDB
Found 2 hits for monomerid = 50297668
Trg + Lig
Ki
nM
ΔG°
kcal/mole
IC50
nM
Kd
nM
EC50/IC50
nM
koff
s-1
kon
M-1s-1
pHTemp
°C
Prostaglandin G/H synthase 2
(Homo sapiens (Human))
BDBM50297668
(4-(2-(cyclohexylamino)-6-(trifluoromethyl)pyrimidi...)
Show SMILES NS(=O)(=O)c1ccc(cc1)-c1cc(nc(NC2CCCCC2)n1)C(F)(F)F
Show InChI InChI=1S/C17H19F3N4O2S/c18-17(19,20)15-10-14(11-6-8-13(9-7-11)27(21,25)26)23-16(24-15)22-12-4-2-1-3-5-12/h6-10,12H,1-5H2,(H2,21,25,26)(H,22,23,24)
NCI pathway
Reactome pathway
n/an/a 2.40n/an/an/an/an/an/a
GlaxoSmithKline
Curated by ChEMBL
Assay Description
Inhibition of human COX2 expressed in baculovirus-infected SF9 cells assessed as inhibition of arachidonic acid-stimulated PGE2 production treated 1 ...
Bioorg Med Chem Lett 19: 4504-8 (2009)
Article DOI: 10.1016/j.bmcl.2009.02.085
BindingDB Entry DOI: 10.7270/Q20Z7396
Prostaglandin G/H synthase 1
(Homo sapiens (Human))
BDBM50297668
(4-(2-(cyclohexylamino)-6-(trifluoromethyl)pyrimidi...)
Show SMILES NS(=O)(=O)c1ccc(cc1)-c1cc(nc(NC2CCCCC2)n1)C(F)(F)F
Show InChI InChI=1S/C17H19F3N4O2S/c18-17(19,20)15-10-14(11-6-8-13(9-7-11)27(21,25)26)23-16(24-15)22-12-4-2-1-3-5-12/h6-10,12H,1-5H2,(H2,21,25,26)(H,22,23,24)
n/an/a 167n/an/an/an/an/an/a
GlaxoSmithKline
Curated by ChEMBL
Assay Description
Inhibition of human COX1 expressed in african green monkey COS cells assessed as inhibition of arachidonic acid-stimulated PGE2 treated 1 hr before a...
Bioorg Med Chem Lett 19: 4504-8 (2009)
Article DOI: 10.1016/j.bmcl.2009.02.085
BindingDB Entry DOI: 10.7270/Q20Z7396