BDBM50297685 2-(cycloheptyloxy)-4-(4-(methylsulfonyl)phenyl)-6-(trifluoromethyl)pyrimidine::CHEMBL561005
SMILES: CS(=O)(=O)c1ccc(cc1)-c1cc(nc(OC2CCCCCC2)n1)C(F)(F)F
InChI Key: InChIKey=HONHICONPPFBQI-UHFFFAOYSA-N
Data: 2 IC50
Activity Spreadsheet -- Enzyme Inhibition Constant Data from BindingDB
Found 2 hits for monomerid = 50297685
Trg + Lig
Ki
nM
ΔG°
kcal/mole
IC50
nM
Kd
nM
EC50/IC50
nM
koff
s-1
kon
M-1s-1
pHTemp
°C
Prostaglandin G/H synthase 1
(Homo sapiens (Human))
BDBM50297685
(2-(cycloheptyloxy)-4-(4-(methylsulfonyl)phenyl)-6-...)
Show SMILES CS(=O)(=O)c1ccc(cc1)-c1cc(nc(OC2CCCCCC2)n1)C(F)(F)F
Show InChI InChI=1S/C19H21F3N2O3S/c1-28(25,26)15-10-8-13(9-11-15)16-12-17(19(20,21)22)24-18(23-16)27-14-6-4-2-3-5-7-14/h8-12,14H,2-7H2,1H3
n/an/a 1.92E+3n/an/an/an/an/an/a
GlaxoSmithKline
Curated by ChEMBL
Assay Description
Inhibition of human COX1 expressed in baculovirus-infected SF9 cells assessed as inhibition of arachidonic acid-stimulated PGE2 production treated 1 ...
Bioorg Med Chem Lett 19: 4504-8 (2009)
Article DOI: 10.1016/j.bmcl.2009.02.085
BindingDB Entry DOI: 10.7270/Q20Z7396
Prostaglandin G/H synthase 2
(Homo sapiens (Human))
BDBM50297685
(2-(cycloheptyloxy)-4-(4-(methylsulfonyl)phenyl)-6-...)
Show SMILES CS(=O)(=O)c1ccc(cc1)-c1cc(nc(OC2CCCCCC2)n1)C(F)(F)F
Show InChI InChI=1S/C19H21F3N2O3S/c1-28(25,26)15-10-8-13(9-11-15)16-12-17(19(20,21)22)24-18(23-16)27-14-6-4-2-3-5-7-14/h8-12,14H,2-7H2,1H3
NCI pathway
Reactome pathway
n/an/a<10n/an/an/an/an/an/a
GlaxoSmithKline
Curated by ChEMBL
Assay Description
Inhibition of human COX2 expressed in baculovirus-infected SF9 cells assessed as inhibition of arachidonic acid-stimulated PGE2 production treated 1 ...
Bioorg Med Chem Lett 19: 4504-8 (2009)
Article DOI: 10.1016/j.bmcl.2009.02.085
BindingDB Entry DOI: 10.7270/Q20Z7396