BDBM50297690 4-(4-(methylsulfonyl)phenyl)-2-(p-tolyloxy)-6-(trifluoromethyl)pyrimidine::CHEMBL564993
SMILES: Cc1ccc(Oc2nc(cc(n2)C(F)(F)F)-c2ccc(cc2)S(C)(=O)=O)cc1
InChI Key: InChIKey=ZKEXYAFRYOEKTR-UHFFFAOYSA-N
Data: 2 IC50
Activity Spreadsheet -- Enzyme Inhibition Constant Data from BindingDB
Found 2 hits for monomerid = 50297690
Trg + Lig
Ki
nM
ΔG°
kcal/mole
IC50
nM
Kd
nM
EC50/IC50
nM
koff
s-1
kon
M-1s-1
pHTemp
°C
Prostaglandin G/H synthase 2
(Homo sapiens (Human))
BDBM50297690
(4-(4-(methylsulfonyl)phenyl)-2-(p-tolyloxy)-6-(tri...)
Show SMILES Cc1ccc(Oc2nc(cc(n2)C(F)(F)F)-c2ccc(cc2)S(C)(=O)=O)cc1
Show InChI InChI=1S/C19H15F3N2O3S/c1-12-3-7-14(8-4-12)27-18-23-16(11-17(24-18)19(20,21)22)13-5-9-15(10-6-13)28(2,25)26/h3-11H,1-2H3
NCI pathway
Reactome pathway
n/an/a<10n/an/an/an/an/an/a
GlaxoSmithKline
Curated by ChEMBL
Assay Description
Inhibition of human COX2 expressed in baculovirus-infected SF9 cells assessed as inhibition of arachidonic acid-stimulated PGE2 production treated 1 ...
Bioorg Med Chem Lett 19: 4504-8 (2009)
Article DOI: 10.1016/j.bmcl.2009.02.085
BindingDB Entry DOI: 10.7270/Q20Z7396
Prostaglandin G/H synthase 1
(Homo sapiens (Human))
BDBM50297690
(4-(4-(methylsulfonyl)phenyl)-2-(p-tolyloxy)-6-(tri...)
Show SMILES Cc1ccc(Oc2nc(cc(n2)C(F)(F)F)-c2ccc(cc2)S(C)(=O)=O)cc1
Show InChI InChI=1S/C19H15F3N2O3S/c1-12-3-7-14(8-4-12)27-18-23-16(11-17(24-18)19(20,21)22)13-5-9-15(10-6-13)28(2,25)26/h3-11H,1-2H3
n/an/a 3.75E+3n/an/an/an/an/an/a
GlaxoSmithKline
Curated by ChEMBL
Assay Description
Inhibition of human COX1 expressed in baculovirus-infected SF9 cells assessed as inhibition of arachidonic acid-stimulated PGE2 production treated 1 ...
Bioorg Med Chem Lett 19: 4504-8 (2009)
Article DOI: 10.1016/j.bmcl.2009.02.085
BindingDB Entry DOI: 10.7270/Q20Z7396