null
SMILES: CN(c1ccccc1)c1ncc(-c2ccc(cc2)S(C)(=O)=O)c(n1)-c1ccc(F)cc1
InChI Key: InChIKey=JVTATFGCZBSYAY-UHFFFAOYSA-N
Activity Spreadsheet -- Enzyme Inhibition Constant Data from BindingDB
Found 2 hits for monomerid = 50297698
Trg + Lig
Ki
nM
ΔG°
kcal/mole
IC50
nM
Kd
nM
EC50/IC50
nM
koff
s-1
kon
M-1s-1
pHTemp
°C
Prostaglandin G/H synthase 2
(Homo sapiens (Human))
BDBM50297698
(4-(4-fluorophenyl)-N-methyl-5-(4-(methylsulfonyl)p...)
Show SMILES CN(c1ccccc1)c1ncc(-c2ccc(cc2)S(C)(=O)=O)c(n1)-c1ccc(F)cc1
Show InChI InChI=1S/C24H20FN3O2S/c1-28(20-6-4-3-5-7-20)24-26-16-22(17-10-14-21(15-11-17)31(2,29)30)23(27-24)18-8-12-19(25)13-9-18/h3-16H,1-2H3
NCI pathway
Reactome pathway
n/an/a 85n/an/an/an/an/an/a
GlaxoSmithKline
Curated by ChEMBL
Assay Description
Inhibition of human COX2 expressed in african green monkey COS cells assessed as inhibition of arachidonic acid-stimulated PGE2 production by enzyme ...
Bioorg Med Chem Lett 19: 4509-14 (2009)
Article DOI: 10.1016/j.bmcl.2009.02.089
BindingDB Entry DOI: 10.7270/Q2W66KSC
Prostaglandin G/H synthase 1
(Homo sapiens (Human))
BDBM50297698
(4-(4-fluorophenyl)-N-methyl-5-(4-(methylsulfonyl)p...)
Show SMILES CN(c1ccccc1)c1ncc(-c2ccc(cc2)S(C)(=O)=O)c(n1)-c1ccc(F)cc1
Show InChI InChI=1S/C24H20FN3O2S/c1-28(20-6-4-3-5-7-20)24-26-16-22(17-10-14-21(15-11-17)31(2,29)30)23(27-24)18-8-12-19(25)13-9-18/h3-16H,1-2H3
n/an/a 4.34E+3n/an/an/an/an/an/a
GlaxoSmithKline
Curated by ChEMBL
Assay Description
Inhibition of human COX1 expressed in african green monkey COS cells assessed as inhibition of arachidonic acid-stimulated PGE2 production by enzyme ...
Bioorg Med Chem Lett 19: 4509-14 (2009)
Article DOI: 10.1016/j.bmcl.2009.02.089
BindingDB Entry DOI: 10.7270/Q2W66KSC