BDBM50297798 4-(cyclohexylmethyl)-6-(pyridin-4-yl)-2-((tetrahydro-2H-pyran-4-yl)methylamino)pyrido[2,3-b]pyrazin-3(4H)-one::CHEMBL563130
SMILES: O=c1c(NCC2CCOCC2)nc2ccc(nc2n1CC1CCCCC1)-c1ccncc1
InChI Key: InChIKey=XJDPFZZXEVNDLY-UHFFFAOYSA-N
Data: 2 IC50
Activity Spreadsheet -- Enzyme Inhibition Constant Data from BindingDB
Found 2 hits for monomerid = 50297798
Trg + Lig
Ki
nM
ΔG°
kcal/mole
IC50
nM
Kd
nM
EC50/IC50
nM
koff
s-1
kon
M-1s-1
pHTemp
°C
3',5'-cyclic phosphodiesterase
(Homo sapiens (Human))
BDBM50297798
(4-(cyclohexylmethyl)-6-(pyridin-4-yl)-2-((tetrahyd...)
Show SMILES O=c1c(NCC2CCOCC2)nc2ccc(nc2n1CC1CCCCC1)-c1ccncc1
Show InChI InChI=1S/C25H31N5O2/c31-25-23(27-16-18-10-14-32-15-11-18)28-22-7-6-21(20-8-12-26-13-9-20)29-24(22)30(25)17-19-4-2-1-3-5-19/h6-9,12-13,18-19H,1-5,10-11,14-17H2,(H,27,28)
Reactome pathway
n/an/a 34n/an/an/an/an/an/a
TBA
Assay Description
Inhibition of PDE5 (unknown origin)
Citation and Details
Article DOI: 10.1007/s00044-010-9523-y
BindingDB Entry DOI: 10.7270/Q2JW8HS3
cGMP-specific 3',5'-cyclic phosphodiesterase
(Homo sapiens (Human))
BDBM50297798
(4-(cyclohexylmethyl)-6-(pyridin-4-yl)-2-((tetrahyd...)
Show SMILES O=c1c(NCC2CCOCC2)nc2ccc(nc2n1CC1CCCCC1)-c1ccncc1
Show InChI InChI=1S/C25H31N5O2/c31-25-23(27-16-18-10-14-32-15-11-18)28-22-7-6-21(20-8-12-26-13-9-20)29-24(22)30(25)17-19-4-2-1-3-5-19/h6-9,12-13,18-19H,1-5,10-11,14-17H2,(H,27,28)
Reactome pathway
n/an/a 0.900n/an/an/an/an/an/a
Pfizer Global Research and Development
Curated by ChEMBL
Assay Description
Inhibition of PDE5
Bioorg Med Chem Lett 19: 4088-91 (2009)
Article DOI: 10.1016/j.bmcl.2009.06.012
BindingDB Entry DOI: 10.7270/Q23R0SXR