BDBM50297799 4-(cyclohexylmethyl)-6-(3,5-dimethylisoxazol-4-yl)-2-(2-morpholinoethylamino)pyrido[2,3-b]pyrazin-3(4H)-one::CHEMBL550817
SMILES: Cc1noc(C)c1-c1ccc2nc(NCCN3CCOCC3)c(=O)n(CC3CCCCC3)c2n1
InChI Key: InChIKey=HYXSOCPVVNKWLZ-UHFFFAOYSA-N
Data: 2 IC50
Activity Spreadsheet -- Enzyme Inhibition Constant Data from BindingDB
Found 2 hits for monomerid = 50297799
Trg + Lig
Ki
nM
ΔG°
kcal/mole
IC50
nM
Kd
nM
EC50/IC50
nM
koff
s-1
kon
M-1s-1
pHTemp
°C
3',5'-cyclic phosphodiesterase
(Homo sapiens (Human))
BDBM50297799
(4-(cyclohexylmethyl)-6-(3,5-dimethylisoxazol-4-yl)...)
Show SMILES Cc1noc(C)c1-c1ccc2nc(NCCN3CCOCC3)c(=O)n(CC3CCCCC3)c2n1
Show InChI InChI=1S/C25H34N6O3/c1-17-22(18(2)34-29-17)20-8-9-21-24(28-20)31(16-19-6-4-3-5-7-19)25(32)23(27-21)26-10-11-30-12-14-33-15-13-30/h8-9,19H,3-7,10-16H2,1-2H3,(H,26,27)
Reactome pathway
n/an/a 36n/an/an/an/an/an/a
TBA
Assay Description
Inhibition of PDE5 (unknown origin)
Citation and Details
Article DOI: 10.1007/s00044-010-9523-y
BindingDB Entry DOI: 10.7270/Q2JW8HS3
cGMP-specific 3',5'-cyclic phosphodiesterase
(Homo sapiens (Human))
BDBM50297799
(4-(cyclohexylmethyl)-6-(3,5-dimethylisoxazol-4-yl)...)
Show SMILES Cc1noc(C)c1-c1ccc2nc(NCCN3CCOCC3)c(=O)n(CC3CCCCC3)c2n1
Show InChI InChI=1S/C25H34N6O3/c1-17-22(18(2)34-29-17)20-8-9-21-24(28-20)31(16-19-6-4-3-5-7-19)25(32)23(27-21)26-10-11-30-12-14-33-15-13-30/h8-9,19H,3-7,10-16H2,1-2H3,(H,26,27)
Reactome pathway
n/an/a 1n/an/an/an/an/an/a
Pfizer Global Research and Development
Curated by ChEMBL
Assay Description
Inhibition of PDE5
Bioorg Med Chem Lett 19: 4088-91 (2009)
Article DOI: 10.1016/j.bmcl.2009.06.012
BindingDB Entry DOI: 10.7270/Q23R0SXR