BDBM50297802 6-(3,4-difluorophenyl)-4-(4-methoxybenzyl)-2-(2-morpholinoethylamino)pyrido[2,3-b]pyrazin-3(4H)-one::CHEMBL556863
SMILES: COc1ccc(Cn2c3nc(ccc3nc(NCCN3CCOCC3)c2=O)-c2ccc(F)c(F)c2)cc1
InChI Key: InChIKey=GGSBSGUIWFYXMM-UHFFFAOYSA-N
Data: 2 IC50
Activity Spreadsheet -- Enzyme Inhibition Constant Data from BindingDB
Found 2 hits for monomerid = 50297802
Trg + Lig
Ki
nM
ΔG°
kcal/mole
IC50
nM
Kd
nM
EC50/IC50
nM
koff
s-1
kon
M-1s-1
pHTemp
°C
3',5'-cyclic phosphodiesterase
(Homo sapiens (Human))
BDBM50297802
(6-(3,4-difluorophenyl)-4-(4-methoxybenzyl)-2-(2-mo...)
Show SMILES COc1ccc(Cn2c3nc(ccc3nc(NCCN3CCOCC3)c2=O)-c2ccc(F)c(F)c2)cc1
Show InChI InChI=1S/C27H27F2N5O3/c1-36-20-5-2-18(3-6-20)17-34-26-24(9-8-23(32-26)19-4-7-21(28)22(29)16-19)31-25(27(34)35)30-10-11-33-12-14-37-15-13-33/h2-9,16H,10-15,17H2,1H3,(H,30,31)
Reactome pathway
n/an/a 2n/an/an/an/an/an/a
TBA
Assay Description
Inhibition of PDE5 (unknown origin)
Citation and Details
Article DOI: 10.1007/s00044-010-9523-y
BindingDB Entry DOI: 10.7270/Q2JW8HS3
cGMP-specific 3',5'-cyclic phosphodiesterase
(Homo sapiens (Human))
BDBM50297802
(6-(3,4-difluorophenyl)-4-(4-methoxybenzyl)-2-(2-mo...)
Show SMILES COc1ccc(Cn2c3nc(ccc3nc(NCCN3CCOCC3)c2=O)-c2ccc(F)c(F)c2)cc1
Show InChI InChI=1S/C27H27F2N5O3/c1-36-20-5-2-18(3-6-20)17-34-26-24(9-8-23(32-26)19-4-7-21(28)22(29)16-19)31-25(27(34)35)30-10-11-33-12-14-37-15-13-33/h2-9,16H,10-15,17H2,1H3,(H,30,31)
Reactome pathway
n/an/a 2n/an/an/an/an/an/a
Pfizer Global Research and Development
Curated by ChEMBL
Assay Description
Inhibition of PDE5
Bioorg Med Chem Lett 19: 4088-91 (2009)
Article DOI: 10.1016/j.bmcl.2009.06.012
BindingDB Entry DOI: 10.7270/Q23R0SXR