BDBM50297806 4-(cyclohexylmethyl)-6-(6-hydroxypyridin-3-yl)-2-((tetrahydro-2H-pyran-4-yl)methylamino)pyrido[2,3-b]pyrazin-3(4H)-one::CHEMBL560609
SMILES: O=c1ccc(c[nH]1)-c1ccc2nc(NCC3CCOCC3)c(=O)n(CC3CCCCC3)c2n1
InChI Key: InChIKey=HBGRKJQESAMPCD-UHFFFAOYSA-N
Data: 1 IC50
Activity Spreadsheet -- Enzyme Inhibition Constant Data from BindingDB
Found 1 hit for monomerid = 50297806
Trg + Lig
Ki
nM
ΔG°
kcal/mole
IC50
nM
Kd
nM
EC50/IC50
nM
koff
s-1
kon
M-1s-1
pHTemp
°C
cGMP-specific 3',5'-cyclic phosphodiesterase
(Homo sapiens (Human))
BDBM50297806
(4-(cyclohexylmethyl)-6-(6-hydroxypyridin-3-yl)-2-(...)
Show SMILES O=c1ccc(c[nH]1)-c1ccc2nc(NCC3CCOCC3)c(=O)n(CC3CCCCC3)c2n1
Show InChI InChI=1S/C25H31N5O3/c31-22-9-6-19(15-26-22)20-7-8-21-24(29-20)30(16-18-4-2-1-3-5-18)25(32)23(28-21)27-14-17-10-12-33-13-11-17/h6-9,15,17-18H,1-5,10-14,16H2,(H,26,31)(H,27,28)
Reactome pathway
n/an/a 2.90n/an/an/an/an/an/a
Pfizer Global Research and Development
Curated by ChEMBL
Assay Description
Inhibition of PDE5
Bioorg Med Chem Lett 19: 4088-91 (2009)
Article DOI: 10.1016/j.bmcl.2009.06.012
BindingDB Entry DOI: 10.7270/Q23R0SXR