BDBM50297809 4-(cyclohexylmethyl)-6-(4-fluorophenyl)-2-(2-morpholinoethylamino)pyrido[2,3-b]pyrazin-3(4H)-one::CHEMBL559889
SMILES: Fc1ccc(cc1)-c1ccc2nc(NCCN3CCOCC3)c(=O)n(CC3CCCCC3)c2n1
InChI Key: InChIKey=NBVSDYOHEQKHOM-UHFFFAOYSA-N
Data: 2 IC50
Activity Spreadsheet -- Enzyme Inhibition Constant Data from BindingDB
Found 2 hits for monomerid = 50297809
Trg + Lig
Ki
nM
ΔG°
kcal/mole
IC50
nM
Kd
nM
EC50/IC50
nM
koff
s-1
kon
M-1s-1
pHTemp
°C
3',5'-cyclic phosphodiesterase
(Homo sapiens (Human))
BDBM50297809
(4-(cyclohexylmethyl)-6-(4-fluorophenyl)-2-(2-morph...)
Show SMILES Fc1ccc(cc1)-c1ccc2nc(NCCN3CCOCC3)c(=O)n(CC3CCCCC3)c2n1
Show InChI InChI=1S/C26H32FN5O2/c27-21-8-6-20(7-9-21)22-10-11-23-25(30-22)32(18-19-4-2-1-3-5-19)26(33)24(29-23)28-12-13-31-14-16-34-17-15-31/h6-11,19H,1-5,12-18H2,(H,28,29)
Reactome pathway
n/an/a 4.60n/an/an/an/an/an/a
TBA
Assay Description
Inhibition of PDE5 (unknown origin)
Citation and Details
Article DOI: 10.1007/s00044-010-9523-y
BindingDB Entry DOI: 10.7270/Q2JW8HS3
cGMP-specific 3',5'-cyclic phosphodiesterase
(Homo sapiens (Human))
BDBM50297809
(4-(cyclohexylmethyl)-6-(4-fluorophenyl)-2-(2-morph...)
Show SMILES Fc1ccc(cc1)-c1ccc2nc(NCCN3CCOCC3)c(=O)n(CC3CCCCC3)c2n1
Show InChI InChI=1S/C26H32FN5O2/c27-21-8-6-20(7-9-21)22-10-11-23-25(30-22)32(18-19-4-2-1-3-5-19)26(33)24(29-23)28-12-13-31-14-16-34-17-15-31/h6-11,19H,1-5,12-18H2,(H,28,29)
Reactome pathway
n/an/a 4.60n/an/an/an/an/an/a
Pfizer Global Research and Development
Curated by ChEMBL
Assay Description
Inhibition of PDE5
Bioorg Med Chem Lett 19: 4088-91 (2009)
Article DOI: 10.1016/j.bmcl.2009.06.012
BindingDB Entry DOI: 10.7270/Q23R0SXR