BDBM50297966 (R)-3-(1-(2-chlorophenyl)ethoxy)-5-(6-(hydroxymethyl)imidazo[1,2-a]pyridin-3-yl)thiophene-2-carboxamide::CHEMBL563447
SMILES: C[C@@H](Oc1cc(sc1C(N)=O)-c1cnc2ccc(CO)cn12)c1ccccc1Cl
InChI Key: InChIKey=BMJXYGYKLFZMCK-GFCCVEGCSA-N
Data: 1 IC50  1 EC50
Activity Spreadsheet -- Enzyme Inhibition Constant Data from BindingDB
Found 2 hits for monomerid = 50297966
Trg + Lig
Ki
nM
ΔG°
kcal/mole
IC50
nM
Kd
nM
EC50/IC50
nM
koff
s-1
kon
M-1s-1
pHTemp
°C
Serine/threonine-protein kinase PLK1
(Homo sapiens (Human))
BDBM50297966
((R)-3-(1-(2-chlorophenyl)ethoxy)-5-(6-(hydroxymeth...)
Show SMILES C[C@@H](Oc1cc(sc1C(N)=O)-c1cnc2ccc(CO)cn12)c1ccccc1Cl |r|
Show InChI InChI=1S/C21H18ClN3O3S/c1-12(14-4-2-3-5-15(14)22)28-17-8-18(29-20(17)21(23)27)16-9-24-19-7-6-13(11-26)10-25(16)19/h2-10,12,26H,11H2,1H3,(H2,23,27)/t12-/m1/s1
NCI pathway
Reactome pathway
n/an/a 7.30n/an/an/an/an/an/a
Banyu Tsukuba Research Institute
Curated by ChEMBL
Assay Description
Inhibition of PLK1
Bioorg Med Chem Lett 19: 4673-8 (2009)
Article DOI: 10.1016/j.bmcl.2009.06.084
BindingDB Entry DOI: 10.7270/Q22R3RQG
Serine/threonine-protein kinase PLK1
(Homo sapiens (Human))
BDBM50297966
((R)-3-(1-(2-chlorophenyl)ethoxy)-5-(6-(hydroxymeth...)
Show SMILES C[C@@H](Oc1cc(sc1C(N)=O)-c1cnc2ccc(CO)cn12)c1ccccc1Cl |r|
Show InChI InChI=1S/C21H18ClN3O3S/c1-12(14-4-2-3-5-15(14)22)28-17-8-18(29-20(17)21(23)27)16-9-24-19-7-6-13(11-26)10-25(16)19/h2-10,12,26H,11H2,1H3,(H2,23,27)/t12-/m1/s1
NCI pathway
Reactome pathway
n/an/an/an/a 210n/an/an/an/a
Banyu Tsukuba Research Institute
Curated by ChEMBL
Assay Description
Inhibition of PLK1-mediated mitosis in human HeLaS3 cells after 18 hrs
Bioorg Med Chem Lett 19: 4673-8 (2009)
Article DOI: 10.1016/j.bmcl.2009.06.084
BindingDB Entry DOI: 10.7270/Q22R3RQG