null
SMILES: C[C@@H](Oc1cc(sc1C(N)=O)-c1cnc2ccccn12)c1ccc(CN2CCS(=O)(=O)CC2)cc1Cl
InChI Key: InChIKey=WXFSRZIOBUJEBP-MRXNPFEDSA-N
Activity Spreadsheet -- Enzyme Inhibition Constant Data from BindingDB
Found 2 hits for monomerid = 50297982
Trg + Lig
Ki
nM
ΔG°
kcal/mole
IC50
nM
Kd
nM
EC50/IC50
nM
koff
s-1
kon
M-1s-1
pHTemp
°C
Serine/threonine-protein kinase PLK1
(Homo sapiens (Human))
BDBM50297982
(3-{(R)-1-[2-Chloro-4-(1,1-dioxo-1lambda*6*-thiomor...)
Show SMILES C[C@@H](Oc1cc(sc1C(N)=O)-c1cnc2ccccn12)c1ccc(CN2CCS(=O)(=O)CC2)cc1Cl |r|
Show InChI InChI=1S/C25H25ClN4O4S2/c1-16(18-6-5-17(12-19(18)26)15-29-8-10-36(32,33)11-9-29)34-21-13-22(35-24(21)25(27)31)20-14-28-23-4-2-3-7-30(20)23/h2-7,12-14,16H,8-11,15H2,1H3,(H2,27,31)/t16-/m1/s1
NCI pathway
Reactome pathway
n/an/a 16n/an/an/an/an/an/a
Banyu Tsukuba Research Institute
Curated by ChEMBL
Assay Description
Inhibition of PLK1
Bioorg Med Chem Lett 19: 4673-8 (2009)
Article DOI: 10.1016/j.bmcl.2009.06.084
BindingDB Entry DOI: 10.7270/Q22R3RQG
Serine/threonine-protein kinase PLK1
(Homo sapiens (Human))
BDBM50297982
(3-{(R)-1-[2-Chloro-4-(1,1-dioxo-1lambda*6*-thiomor...)
Show SMILES C[C@@H](Oc1cc(sc1C(N)=O)-c1cnc2ccccn12)c1ccc(CN2CCS(=O)(=O)CC2)cc1Cl |r|
Show InChI InChI=1S/C25H25ClN4O4S2/c1-16(18-6-5-17(12-19(18)26)15-29-8-10-36(32,33)11-9-29)34-21-13-22(35-24(21)25(27)31)20-14-28-23-4-2-3-7-30(20)23/h2-7,12-14,16H,8-11,15H2,1H3,(H2,27,31)/t16-/m1/s1
NCI pathway
Reactome pathway
n/an/an/an/a 4.00E+5n/an/an/an/a
Banyu Tsukuba Research Institute
Curated by ChEMBL
Assay Description
Inhibition of PLK1-mediated mitosis in human HeLaS3 cells after 18 hrs
Bioorg Med Chem Lett 19: 4673-8 (2009)
Article DOI: 10.1016/j.bmcl.2009.06.084
BindingDB Entry DOI: 10.7270/Q22R3RQG