BDBM50297995 (+/-)-5-(2-fluorophenyl)-4,5,6,7-tetrahydro-1H-indazole-3-carboxylic acid::CHEMBL562632
SMILES: OC(=O)c1n[nH]c2CCC(Cc12)c1ccccc1F
InChI Key: InChIKey=IBIKXOKLTWYROG-UHFFFAOYSA-N
Data: 1 IC50  1 EC50
Activity Spreadsheet -- Enzyme Inhibition Constant Data from BindingDB
Found 2 hits for monomerid = 50297995
Trg + Lig
Ki
nM
ΔG°
kcal/mole
IC50
nM
Kd
nM
EC50/IC50
nM
koff
s-1
kon
M-1s-1
pHTemp
°C
Hydroxycarboxylic acid receptor 2
(Homo sapiens (Human))
BDBM50297995
((+/-)-5-(2-fluorophenyl)-4,5,6,7-tetrahydro-1H-ind...)
Show SMILES OC(=O)c1n[nH]c2CCC(Cc12)c1ccccc1F
Show InChI InChI=1S/C14H13FN2O2/c15-11-4-2-1-3-9(11)8-5-6-12-10(7-8)13(14(18)19)17-16-12/h1-4,8H,5-7H2,(H,16,17)(H,18,19)
Reactome pathway
n/an/an/an/a 4.40E+3n/an/an/an/a
Merck Research Laboratories
Curated by ChEMBL
Assay Description
Agonist activity at human niacin receptor expressed in CKO-K1 cells by [35S]GTPgammaS binding assay
Bioorg Med Chem Lett 19: 4768-72 (2009)
Article DOI: 10.1016/j.bmcl.2009.06.054
BindingDB Entry DOI: 10.7270/Q2M909M3
Hydroxycarboxylic acid receptor 2
(Homo sapiens (Human))
BDBM50297995
((+/-)-5-(2-fluorophenyl)-4,5,6,7-tetrahydro-1H-ind...)
Show SMILES OC(=O)c1n[nH]c2CCC(Cc12)c1ccccc1F
Show InChI InChI=1S/C14H13FN2O2/c15-11-4-2-1-3-9(11)8-5-6-12-10(7-8)13(14(18)19)17-16-12/h1-4,8H,5-7H2,(H,16,17)(H,18,19)
Reactome pathway
n/an/a 270n/an/an/an/an/an/a
Merck Research Laboratories
Curated by ChEMBL
Assay Description
Displacement of [3H]niacin from human niacin receptor expressed in CKO-K1 cells in absence of 5% human serum
Bioorg Med Chem Lett 19: 4768-72 (2009)
Article DOI: 10.1016/j.bmcl.2009.06.054
BindingDB Entry DOI: 10.7270/Q2M909M3