null
SMILES: COCCN1CC[C@@H](C1)N(Cc1ccccc1Cl)c1ccc(C#N)c(Cl)c1
InChI Key: InChIKey=HHPQPMZEABBAEF-IBGZPJMESA-N
Activity Spreadsheet -- Enzyme Inhibition Constant Data from BindingDB
Found 2 hits for monomerid = 50298031
Trg + Lig
Ki
nM
ΔG°
kcal/mole
IC50
nM
Kd
nM
EC50/IC50
nM
koff
s-1
kon
M-1s-1
pHTemp
°C
Progesterone receptor
(Homo sapiens (Human))
BDBM50298031
((S)-2-chloro-4-((2-chlorobenzyl)(1-(2-methoxyethyl...)
Show SMILES COCCN1CC[C@@H](C1)N(Cc1ccccc1Cl)c1ccc(C#N)c(Cl)c1 |r|
Show InChI InChI=1S/C21H23Cl2N3O/c1-27-11-10-25-9-8-19(15-25)26(14-17-4-2-3-5-20(17)22)18-7-6-16(13-24)21(23)12-18/h2-7,12,19H,8-11,14-15H2,1H3/t19-/m0/s1
n/an/an/an/a 50n/an/an/an/a
GlaxoSmithKline Pharmaceuticals
Curated by ChEMBL
Assay Description
Agonist activity at PR expressed in african green monkey CV-1 cells by luciferase reporter assay
Bioorg Med Chem Lett 19: 4777-80 (2009)
Article DOI: 10.1016/j.bmcl.2009.06.055
BindingDB Entry DOI: 10.7270/Q2TB16XG
Progesterone receptor
(Homo sapiens (Human))
BDBM50298031
((S)-2-chloro-4-((2-chlorobenzyl)(1-(2-methoxyethyl...)
Show SMILES COCCN1CC[C@@H](C1)N(Cc1ccccc1Cl)c1ccc(C#N)c(Cl)c1 |r|
Show InChI InChI=1S/C21H23Cl2N3O/c1-27-11-10-25-9-8-19(15-25)26(14-17-4-2-3-5-20(17)22)18-7-6-16(13-24)21(23)12-18/h2-7,12,19H,8-11,14-15H2,1H3/t19-/m0/s1
n/an/a 25n/an/an/an/an/an/a
GlaxoSmithKline Pharmaceuticals
Curated by ChEMBL
Assay Description
Binding affinity to PR by fluorescence polarization based competition binding assay
Bioorg Med Chem Lett 19: 4777-80 (2009)
Article DOI: 10.1016/j.bmcl.2009.06.055
BindingDB Entry DOI: 10.7270/Q2TB16XG