BDBM50298576 (R)-2-(2-(1H-indole-2-carboxamido)benzamido)-3-phenylpropanoic acid::CHEMBL578650
SMILES: OC(=O)[C@@H](Cc1ccccc1)NC(=O)c1ccccc1NC(=O)c1cc2ccccc2[nH]1
InChI Key: InChIKey=GXZXQTARIHFJCZ-JOCHJYFZSA-N
Data: 1 IC50
Activity Spreadsheet -- Enzyme Inhibition Constant Data from BindingDB
Found 1 hit for monomerid = 50298576
Trg + Lig
Ki
nM
ΔG°
kcal/mole
IC50
nM
Kd
nM
EC50/IC50
nM
koff
s-1
kon
M-1s-1
pHTemp
°C
Cholecystokinin receptor
(RAT)
BDBM50298576
((R)-2-(2-(1H-indole-2-carboxamido)benzamido)-3-phe...)
Show SMILES OC(=O)[C@@H](Cc1ccccc1)NC(=O)c1ccccc1NC(=O)c1cc2ccccc2[nH]1 |r|
Show InChI InChI=1S/C25H21N3O4/c29-23(28-22(25(31)32)14-16-8-2-1-3-9-16)18-11-5-7-13-20(18)27-24(30)21-15-17-10-4-6-12-19(17)26-21/h1-13,15,22,26H,14H2,(H,27,30)(H,28,29)(H,31,32)/t22-/m1/s1
Reactome pathway
n/an/a 106n/an/an/an/an/an/a
Aristotelian University of Thessaloniki
Curated by ChEMBL
Assay Description
Displacement of [125I]-CCK8 from CCK1 receptor in rat pancreatic acinar cells
Bioorg Med Chem 17: 5198-206 (2009)
Article DOI: 10.1016/j.bmc.2009.05.067
BindingDB Entry DOI: 10.7270/Q2QC03JB