BDBM50298595 (+/-)-2-(2-(benzofuran-2-carboxamido)benzamido)-3-phenylpropanoic acid::CHEMBL579245
SMILES: OC(=O)C(Cc1ccccc1)NC(=O)c1ccccc1NC(=O)c1cc2ccccc2o1
InChI Key: InChIKey=IAJYGGOZTIKTRG-UHFFFAOYSA-N
Data: 1 IC50
Activity Spreadsheet -- Enzyme Inhibition Constant Data from BindingDB
Found 1 hit for monomerid = 50298595
Trg + Lig
Ki
nM
ΔG°
kcal/mole
IC50
nM
Kd
nM
EC50/IC50
nM
koff
s-1
kon
M-1s-1
pHTemp
°C
Cholecystokinin receptor
(RAT)
BDBM50298595
((+/-)-2-(2-(benzofuran-2-carboxamido)benzamido)-3-...)
Show SMILES OC(=O)C(Cc1ccccc1)NC(=O)c1ccccc1NC(=O)c1cc2ccccc2o1
Show InChI InChI=1S/C25H20N2O5/c28-23(27-20(25(30)31)14-16-8-2-1-3-9-16)18-11-5-6-12-19(18)26-24(29)22-15-17-10-4-7-13-21(17)32-22/h1-13,15,20H,14H2,(H,26,29)(H,27,28)(H,30,31)
Reactome pathway
n/an/a 891n/an/an/an/an/an/a
Aristotelian University of Thessaloniki
Curated by ChEMBL
Assay Description
Displacement of [125I]-CCK8 from CCK1 receptor in rat pancreatic acinar cells
Bioorg Med Chem 17: 5198-206 (2009)
Article DOI: 10.1016/j.bmc.2009.05.067
BindingDB Entry DOI: 10.7270/Q2QC03JB