BDBM50298814 (R)-5-(3-(5-methoxy-4'-methylbiphenyl-3-yl)but-1-ynyl)-6-methylpyrimidine-2,4-diamine::5-[(3R)-3-(5-methoxy-4'-methylbiphenyl-3-yl)but-1-yn-1-yl]-6-methylpyrimidine-2,4-diamine::CHEMBL575218
SMILES: COc1cc(cc(c1)-c1ccc(C)cc1)[C@@H](C)C#Cc1c(C)nc(N)nc1N
InChI Key: InChIKey=QVXYJVHNRPNRJL-HNNXBMFYSA-N
Data: 1 IC50
PDB links: 2 PDB IDs match this monomer.
Activity Spreadsheet -- Enzyme Inhibition Constant Data from BindingDB
Found 1 hit for monomerid = 50298814
Trg + Lig
Ki
nM
ΔG°
kcal/mole
IC50
nM
Kd
nM
EC50/IC50
nM
koff
s-1
kon
M-1s-1
pHTemp
°C
Dihydrofolate Reductase (DHFR)
(Candida albicans)
BDBM50298814
((R)-5-(3-(5-methoxy-4'-methylbiphenyl-3-yl)but-1-y...)
Show SMILES COc1cc(cc(c1)-c1ccc(C)cc1)[C@@H](C)C#Cc1c(C)nc(N)nc1N |r|
Show InChI InChI=1S/C23H24N4O/c1-14-5-8-17(9-6-14)19-11-18(12-20(13-19)28-4)15(2)7-10-21-16(3)26-23(25)27-22(21)24/h5-6,8-9,11-13,15H,1-4H3,(H4,24,25,26,27)/t15-/m0/s1
n/an/a 22n/an/an/an/an/an/a
University of Connecticut
Curated by ChEMBL
Assay Description
Inhibition of Candida albicans DHFR expressed in Escherichia coli BL21 (DE3) assessed as rate of NADPH consumption using dihydrofolate as susbtrate
Bioorg Med Chem 17: 4866-72 (2009)
Article DOI: 10.1016/j.bmc.2009.06.021
BindingDB Entry DOI: 10.7270/Q2JM29P7
3D
3D Structure (crystal)