BDBM50299075 5-Methyl-3-{3-[4-(methylsulfinyl)phenyl]-1-benzofuran-5-yl}-1,2,4-oxadiazole::CHEMBL574600
SMILES: Cc1nc(no1)-c1ccc2occ(-c3ccc(cc3)S(C)=O)c2c1
InChI Key: InChIKey=JLFKBOGEUSGFBA-UHFFFAOYSA-N
Data: 1 IC50
Activity Spreadsheet -- Enzyme Inhibition Constant Data from BindingDB
Found 1 hit for monomerid = 50299075
Trg + Lig
Ki
nM
ΔG°
kcal/mole
IC50
nM
Kd
nM
EC50/IC50
nM
koff
s-1
kon
M-1s-1
pHTemp
°C
Glycogen synthase kinase-3 beta
(Homo sapiens (Human))
BDBM50299075
(5-Methyl-3-{3-[4-(methylsulfinyl)phenyl]-1-benzofu...)
Show SMILES Cc1nc(no1)-c1ccc2occ(-c3ccc(cc3)S(C)=O)c2c1
Show InChI InChI=1S/C18H14N2O3S/c1-11-19-18(20-23-11)13-5-8-17-15(9-13)16(10-22-17)12-3-6-14(7-4-12)24(2)21/h3-10H,1-2H3
NCI pathway
Reactome pathway
n/an/a 680n/an/an/an/an/an/a
Takeda Pharmaceutical Company, Ltd.
Curated by ChEMBL
Assay Description
Inhibition of human recombinant GSK3-beta
J Med Chem 52: 6270-86 (2009)
Article DOI: 10.1021/jm900647e
BindingDB Entry DOI: 10.7270/Q2CZ377V