BDBM50299084 2-{3-[4-(Ethylsulfonyl)phenyl]-1-benzofuran-5-yl}-5-methyl-1,3,4-oxadiazole::CHEMBL578628
SMILES: CCS(=O)(=O)c1ccc(cc1)-c1coc2ccc(cc12)-c1ccc(C)o1
InChI Key: InChIKey=BQTJRYNLKIVLQR-UHFFFAOYSA-N
Data: 1 IC50
Activity Spreadsheet -- Enzyme Inhibition Constant Data from BindingDB
Found 1 hit for monomerid = 50299084
Trg + Lig
Ki
nM
ΔG°
kcal/mole
IC50
nM
Kd
nM
EC50/IC50
nM
koff
s-1
kon
M-1s-1
pHTemp
°C
Glycogen synthase kinase-3 beta
(Homo sapiens (Human))
BDBM50299084
(2-{3-[4-(Ethylsulfonyl)phenyl]-1-benzofuran-5-yl}-...)
Show SMILES CCS(=O)(=O)c1ccc(cc1)-c1coc2ccc(cc12)-c1ccc(C)o1
Show InChI InChI=1S/C21H18O4S/c1-3-26(22,23)17-8-5-15(6-9-17)19-13-24-21-11-7-16(12-18(19)21)20-10-4-14(2)25-20/h4-13H,3H2,1-2H3
NCI pathway
Reactome pathway
n/an/a 38n/an/an/an/an/an/a
Takeda Pharmaceutical Company, Ltd.
Curated by ChEMBL
Assay Description
Inhibition of human recombinant GSK3-beta
J Med Chem 52: 6270-86 (2009)
Article DOI: 10.1021/jm900647e
BindingDB Entry DOI: 10.7270/Q2CZ377V