BDBM50299094 1-{4-[5-(5-Methyl-1,3,4-oxadiazol-2-yl)-1-benzofuran-3-yl]-phenyl}ethanol::CHEMBL573933
SMILES: CC(O)c1ccc(cc1)-c1coc2ccc(cc12)-c1ccc(C)o1
InChI Key: InChIKey=MGMVBUGQYOEFEX-UHFFFAOYSA-N
Data: 1 IC50
Activity Spreadsheet -- Enzyme Inhibition Constant Data from BindingDB
Found 1 hit for monomerid = 50299094
Trg + Lig
Ki
nM
ΔG°
kcal/mole
IC50
nM
Kd
nM
EC50/IC50
nM
koff
s-1
kon
M-1s-1
pHTemp
°C
Glycogen synthase kinase-3 beta
(Homo sapiens (Human))
BDBM50299094
(1-{4-[5-(5-Methyl-1,3,4-oxadiazol-2-yl)-1-benzofur...)
Show SMILES CC(O)c1ccc(cc1)-c1coc2ccc(cc12)-c1ccc(C)o1
Show InChI InChI=1S/C21H18O3/c1-13-3-9-20(24-13)17-8-10-21-18(11-17)19(12-23-21)16-6-4-15(5-7-16)14(2)22/h3-12,14,22H,1-2H3
NCI pathway
Reactome pathway
n/an/a 160n/an/an/an/an/an/a
Takeda Pharmaceutical Company, Ltd.
Curated by ChEMBL
Assay Description
Inhibition of human recombinant GSK3-beta
J Med Chem 52: 6270-86 (2009)
Article DOI: 10.1021/jm900647e
BindingDB Entry DOI: 10.7270/Q2CZ377V