BDBM50299138 (S)-1-(4-(5-cyclopropyl-1H-pyrazol-3-ylamino)pyrrolo[1,2-f][1,2,4]triazin-2-yl)pyrrolidine-2-carboxamide::CHEMBL575888
SMILES: NC(=O)[C@@H]1CCCN1c1nc(Nc2cc([nH]n2)C2CC2)c2cccn2n1
InChI Key: InChIKey=CGJRRFJDMMUHJW-LBPRGKRZSA-N
Data: 2 IC50
Activity Spreadsheet -- Enzyme Inhibition Constant Data from BindingDB
Found 2 hits for monomerid = 50299138
Trg + Lig
Ki
nM
ΔG°
kcal/mole
IC50
nM
Kd
nM
EC50/IC50
nM
koff
s-1
kon
M-1s-1
pHTemp
°C
CDK2/Cyclin E/G1/S-specific cyclin E2
(Homo sapiens (Human))
BDBM50299138
((S)-1-(4-(5-cyclopropyl-1H-pyrazol-3-ylamino)pyrro...)
Show SMILES NC(=O)[C@@H]1CCCN1c1nc(Nc2cc([nH]n2)C2CC2)c2cccn2n1 |r|
Show InChI InChI=1S/C17H20N8O/c18-15(26)12-3-1-7-24(12)17-20-16(13-4-2-8-25(13)23-17)19-14-9-11(21-22-14)10-5-6-10/h2,4,8-10,12H,1,3,5-7H2,(H2,18,26)(H2,19,20,21,22,23)/t12-/m0/s1
n/an/a 2n/an/an/an/an/an/a
Bristol-Myers Squibb Co
Curated by ChEMBL
Assay Description
Inhibition of CDK2/Cyclin E after 60 mins by fluorescence electrophoresis
J Med Chem 52: 7360-3 (2009)
Article DOI: 10.1021/jm900786r
BindingDB Entry DOI: 10.7270/Q2P27022
Insulin-like growth factor I receptor
(Homo sapiens (Human))
BDBM50299138
((S)-1-(4-(5-cyclopropyl-1H-pyrazol-3-ylamino)pyrro...)
Show SMILES NC(=O)[C@@H]1CCCN1c1nc(Nc2cc([nH]n2)C2CC2)c2cccn2n1 |r|
Show InChI InChI=1S/C17H20N8O/c18-15(26)12-3-1-7-24(12)17-20-16(13-4-2-8-25(13)23-17)19-14-9-11(21-22-14)10-5-6-10/h2,4,8-10,12H,1,3,5-7H2,(H2,18,26)(H2,19,20,21,22,23)/t12-/m0/s1
Reactome pathway
n/an/a 41n/an/an/an/an/an/a
Bristol-Myers Squibb Co
Curated by ChEMBL
Assay Description
Inhibition of IGF1R after 60 mins by fluorescence electrophoresis
J Med Chem 52: 7360-3 (2009)
Article DOI: 10.1021/jm900786r
BindingDB Entry DOI: 10.7270/Q2P27022