BDBM50299166 (6aR,9R)-N,N-diethyl-4,6,6a,7,8,9-hexahydroindolo[4,3-fg]quinoline-9-carboxamide::4,6,6a,7,8,9-Hexahydro-indolo[4,3-fg]quinoline-9-carboxylic acid diethylamide::CHEMBL21343
SMILES: CCN(CC)C(=O)[C@H]1CN[C@@H]2Cc3c[nH]c4cccc(C2=C1)c34
InChI Key: InChIKey=SUXLVXOMPKZBOV-CXAGYDPISA-N
Data: 13 IC50
Activity Spreadsheet -- Enzyme Inhibition Constant Data from BindingDB
Found 13 hits for monomerid = 50299166
Trg + Lig
Ki
nM
ΔG°
kcal/mole
IC50
nM
Kd
nM
EC50/IC50
nM
koff
s-1
kon
M-1s-1
pHTemp
°C
Alpha-2C adrenergic receptor
(Homo sapiens (Human))
BDBM50299166
((6aR,9R)-N,N-diethyl-4,6,6a,7,8,9-hexahydroindolo[...)
Show SMILES CCN(CC)C(=O)[C@H]1CN[C@@H]2Cc3c[nH]c4cccc(C2=C1)c34 |r,c:21|
Show InChI InChI=1S/C19H23N3O/c1-3-22(4-2)19(23)13-8-15-14-6-5-7-16-18(14)12(10-20-16)9-17(15)21-11-13/h5-8,10,13,17,20-21H,3-4,9,11H2,1-2H3/t13-,17-/m1/s1
n/an/a>1.00E+4n/an/an/an/an/an/a
Novartis Institutes for BioMedical Research
Curated by ChEMBL
Assay Description
Inhibition of adrenergic alpha2C receptor
Bioorg Med Chem Lett 19: 6185-8 (2009)
Article DOI: 10.1016/j.bmcl.2009.09.002
BindingDB Entry DOI: 10.7270/Q2VX0GJN
Alpha-2A adrenergic receptor
(Homo sapiens (Human))
BDBM50299166
((6aR,9R)-N,N-diethyl-4,6,6a,7,8,9-hexahydroindolo[...)
Show SMILES CCN(CC)C(=O)[C@H]1CN[C@@H]2Cc3c[nH]c4cccc(C2=C1)c34 |r,c:21|
Show InChI InChI=1S/C19H23N3O/c1-3-22(4-2)19(23)13-8-15-14-6-5-7-16-18(14)12(10-20-16)9-17(15)21-11-13/h5-8,10,13,17,20-21H,3-4,9,11H2,1-2H3/t13-,17-/m1/s1
n/an/a>1.00E+4n/an/an/an/an/an/a
Novartis Institutes for BioMedical Research
Curated by ChEMBL
Assay Description
Inhibition of adrenergic alpha2A receptor
Bioorg Med Chem Lett 19: 6185-8 (2009)
Article DOI: 10.1016/j.bmcl.2009.09.002
BindingDB Entry DOI: 10.7270/Q2VX0GJN
D(3) dopamine receptor
(Homo sapiens (Human))
BDBM50299166
((6aR,9R)-N,N-diethyl-4,6,6a,7,8,9-hexahydroindolo[...)
Show SMILES CCN(CC)C(=O)[C@H]1CN[C@@H]2Cc3c[nH]c4cccc(C2=C1)c34 |r,c:21|
Show InChI InChI=1S/C19H23N3O/c1-3-22(4-2)19(23)13-8-15-14-6-5-7-16-18(14)12(10-20-16)9-17(15)21-11-13/h5-8,10,13,17,20-21H,3-4,9,11H2,1-2H3/t13-,17-/m1/s1
n/an/a>1.00E+4n/an/an/an/an/an/a
Novartis Institutes for BioMedical Research
Curated by ChEMBL
Assay Description
Inhibition of dopamine D3 receptor
Bioorg Med Chem Lett 19: 6185-8 (2009)
Article DOI: 10.1016/j.bmcl.2009.09.002
BindingDB Entry DOI: 10.7270/Q2VX0GJN
D(2) dopamine receptor
(Homo sapiens (Human))
BDBM50299166
((6aR,9R)-N,N-diethyl-4,6,6a,7,8,9-hexahydroindolo[...)
Show SMILES CCN(CC)C(=O)[C@H]1CN[C@@H]2Cc3c[nH]c4cccc(C2=C1)c34 |r,c:21|
Show InChI InChI=1S/C19H23N3O/c1-3-22(4-2)19(23)13-8-15-14-6-5-7-16-18(14)12(10-20-16)9-17(15)21-11-13/h5-8,10,13,17,20-21H,3-4,9,11H2,1-2H3/t13-,17-/m1/s1
Reactome pathway
n/an/a>1.00E+4n/an/an/an/an/an/a
Novartis Institutes for BioMedical Research
Curated by ChEMBL
Assay Description
Inhibition of dopamine D2 receptor
Bioorg Med Chem Lett 19: 6185-8 (2009)
Article DOI: 10.1016/j.bmcl.2009.09.002
BindingDB Entry DOI: 10.7270/Q2VX0GJN
D(1A) dopamine receptor
(Homo sapiens (Human))
BDBM50299166
((6aR,9R)-N,N-diethyl-4,6,6a,7,8,9-hexahydroindolo[...)
Show SMILES CCN(CC)C(=O)[C@H]1CN[C@@H]2Cc3c[nH]c4cccc(C2=C1)c34 |r,c:21|
Show InChI InChI=1S/C19H23N3O/c1-3-22(4-2)19(23)13-8-15-14-6-5-7-16-18(14)12(10-20-16)9-17(15)21-11-13/h5-8,10,13,17,20-21H,3-4,9,11H2,1-2H3/t13-,17-/m1/s1
n/an/a>1.00E+4n/an/an/an/an/an/a
Novartis Institutes for BioMedical Research
Curated by ChEMBL
Assay Description
Inhibition of dopamine D1 receptor
Bioorg Med Chem Lett 19: 6185-8 (2009)
Article DOI: 10.1016/j.bmcl.2009.09.002
BindingDB Entry DOI: 10.7270/Q2VX0GJN
5-hydroxytryptamine receptor 7
(Homo sapiens (Human))
BDBM50299166
((6aR,9R)-N,N-diethyl-4,6,6a,7,8,9-hexahydroindolo[...)
Show SMILES CCN(CC)C(=O)[C@H]1CN[C@@H]2Cc3c[nH]c4cccc(C2=C1)c34 |r,c:21|
Show InChI InChI=1S/C19H23N3O/c1-3-22(4-2)19(23)13-8-15-14-6-5-7-16-18(14)12(10-20-16)9-17(15)21-11-13/h5-8,10,13,17,20-21H,3-4,9,11H2,1-2H3/t13-,17-/m1/s1
Reactome pathway
n/an/a 143n/an/an/an/an/an/a
Novartis Institutes for BioMedical Research
Curated by ChEMBL
Assay Description
Inhibition of 5HT7 receptor
Bioorg Med Chem Lett 19: 6185-8 (2009)
Article DOI: 10.1016/j.bmcl.2009.09.002
BindingDB Entry DOI: 10.7270/Q2VX0GJN
Beta-1 adrenergic receptor
(Homo sapiens (Human))
BDBM50299166
((6aR,9R)-N,N-diethyl-4,6,6a,7,8,9-hexahydroindolo[...)
Show SMILES CCN(CC)C(=O)[C@H]1CN[C@@H]2Cc3c[nH]c4cccc(C2=C1)c34 |r,c:21|
Show InChI InChI=1S/C19H23N3O/c1-3-22(4-2)19(23)13-8-15-14-6-5-7-16-18(14)12(10-20-16)9-17(15)21-11-13/h5-8,10,13,17,20-21H,3-4,9,11H2,1-2H3/t13-,17-/m1/s1
Reactome pathway
n/an/a>1.00E+4n/an/an/an/an/an/a
Novartis Institutes for BioMedical Research
Curated by ChEMBL
Assay Description
Inhibition of adrenergic beta1 receptor
Bioorg Med Chem Lett 19: 6185-8 (2009)
Article DOI: 10.1016/j.bmcl.2009.09.002
BindingDB Entry DOI: 10.7270/Q2VX0GJN
5-hydroxytryptamine receptor 2C
(Homo sapiens (Human))
BDBM50299166
((6aR,9R)-N,N-diethyl-4,6,6a,7,8,9-hexahydroindolo[...)
Show SMILES CCN(CC)C(=O)[C@H]1CN[C@@H]2Cc3c[nH]c4cccc(C2=C1)c34 |r,c:21|
Show InChI InChI=1S/C19H23N3O/c1-3-22(4-2)19(23)13-8-15-14-6-5-7-16-18(14)12(10-20-16)9-17(15)21-11-13/h5-8,10,13,17,20-21H,3-4,9,11H2,1-2H3/t13-,17-/m1/s1
Reactome pathway
n/an/a 1.29E+3n/an/an/an/an/an/a
Novartis Institutes for BioMedical Research
Curated by ChEMBL
Assay Description
Inhibition of 5HT2C receptor
Bioorg Med Chem Lett 19: 6185-8 (2009)
Article DOI: 10.1016/j.bmcl.2009.09.002
BindingDB Entry DOI: 10.7270/Q2VX0GJN
5-hydroxytryptamine receptor 2B
(Homo sapiens (Human))
BDBM50299166
((6aR,9R)-N,N-diethyl-4,6,6a,7,8,9-hexahydroindolo[...)
Show SMILES CCN(CC)C(=O)[C@H]1CN[C@@H]2Cc3c[nH]c4cccc(C2=C1)c34 |r,c:21|
Show InChI InChI=1S/C19H23N3O/c1-3-22(4-2)19(23)13-8-15-14-6-5-7-16-18(14)12(10-20-16)9-17(15)21-11-13/h5-8,10,13,17,20-21H,3-4,9,11H2,1-2H3/t13-,17-/m1/s1
Reactome pathway
n/an/a 54n/an/an/an/an/an/a
Novartis Institutes for BioMedical Research
Curated by ChEMBL
Assay Description
Inhibition of 5HT2B receptor
Bioorg Med Chem Lett 19: 6185-8 (2009)
Article DOI: 10.1016/j.bmcl.2009.09.002
BindingDB Entry DOI: 10.7270/Q2VX0GJN
5-hydroxytryptamine receptor 2A
(Homo sapiens (Human))
BDBM50299166
((6aR,9R)-N,N-diethyl-4,6,6a,7,8,9-hexahydroindolo[...)
Show SMILES CCN(CC)C(=O)[C@H]1CN[C@@H]2Cc3c[nH]c4cccc(C2=C1)c34 |r,c:21|
Show InChI InChI=1S/C19H23N3O/c1-3-22(4-2)19(23)13-8-15-14-6-5-7-16-18(14)12(10-20-16)9-17(15)21-11-13/h5-8,10,13,17,20-21H,3-4,9,11H2,1-2H3/t13-,17-/m1/s1
Reactome pathway
n/an/a 6n/an/an/an/an/an/a
Novartis Institutes for BioMedical Research
Curated by ChEMBL
Assay Description
Inhibition of 5HT2A receptor
Bioorg Med Chem Lett 19: 6185-8 (2009)
Article DOI: 10.1016/j.bmcl.2009.09.002
BindingDB Entry DOI: 10.7270/Q2VX0GJN
5-hydroxytryptamine receptor 1A
(Homo sapiens (Human))
BDBM50299166
((6aR,9R)-N,N-diethyl-4,6,6a,7,8,9-hexahydroindolo[...)
Show SMILES CCN(CC)C(=O)[C@H]1CN[C@@H]2Cc3c[nH]c4cccc(C2=C1)c34 |r,c:21|
Show InChI InChI=1S/C19H23N3O/c1-3-22(4-2)19(23)13-8-15-14-6-5-7-16-18(14)12(10-20-16)9-17(15)21-11-13/h5-8,10,13,17,20-21H,3-4,9,11H2,1-2H3/t13-,17-/m1/s1
n/an/a 3n/an/an/an/an/an/a
Novartis Institutes for BioMedical Research
Curated by ChEMBL
Assay Description
Inhibition of 5HT1A receptor
Bioorg Med Chem Lett 19: 6185-8 (2009)
Article DOI: 10.1016/j.bmcl.2009.09.002
BindingDB Entry DOI: 10.7270/Q2VX0GJN
chemokine (C-X-C motif) receptor 3
(Homo sapiens (Human))
BDBM50299166
((6aR,9R)-N,N-diethyl-4,6,6a,7,8,9-hexahydroindolo[...)
Show SMILES CCN(CC)C(=O)[C@H]1CN[C@@H]2Cc3c[nH]c4cccc(C2=C1)c34 |r,c:21|
Show InChI InChI=1S/C19H23N3O/c1-3-22(4-2)19(23)13-8-15-14-6-5-7-16-18(14)12(10-20-16)9-17(15)21-11-13/h5-8,10,13,17,20-21H,3-4,9,11H2,1-2H3/t13-,17-/m1/s1
n/an/a>1.00E+4n/an/an/an/an/an/a
Novartis Institutes for BioMedical Research
Curated by ChEMBL
Assay Description
Displacement of [125I]I-TAC from human CXCR3 expressed in CHO cells by scintillation proximity assay
Bioorg Med Chem Lett 19: 6185-8 (2009)
Article DOI: 10.1016/j.bmcl.2009.09.002
BindingDB Entry DOI: 10.7270/Q2VX0GJN
5-hydroxytryptamine receptor 6
(Homo sapiens (Human))
BDBM50299166
((6aR,9R)-N,N-diethyl-4,6,6a,7,8,9-hexahydroindolo[...)
Show SMILES CCN(CC)C(=O)[C@H]1CN[C@@H]2Cc3c[nH]c4cccc(C2=C1)c34 |r,c:21|
Show InChI InChI=1S/C19H23N3O/c1-3-22(4-2)19(23)13-8-15-14-6-5-7-16-18(14)12(10-20-16)9-17(15)21-11-13/h5-8,10,13,17,20-21H,3-4,9,11H2,1-2H3/t13-,17-/m1/s1
Reactome pathway
n/an/a 16n/an/an/an/an/an/a
Novartis Institutes for BioMedical Research
Curated by ChEMBL
Assay Description
Inhibition of 5HT6 receptor
Bioorg Med Chem Lett 19: 6185-8 (2009)
Article DOI: 10.1016/j.bmcl.2009.09.002
BindingDB Entry DOI: 10.7270/Q2VX0GJN