BDBM50299371 CHEMBL573152::N2-(2,3-dihydro-1H-inden-2-yl)-6-(4-methylpiperazin-1-yl)-N4-(pyridin-4-yl)-1,3,5-triazine-2,4-diamine
SMILES: CN1CCN(CC1)c1nc(NC2Cc3ccccc3C2)nc(Nc2ccncc2)n1
InChI Key: InChIKey=JEBRKVCPEQRUBJ-UHFFFAOYSA-N
Data: 1 IC50
Activity Spreadsheet -- Enzyme Inhibition Constant Data from BindingDB
Found 1 hit for monomerid = 50299371
Trg + Lig
Ki
nM
ΔG°
kcal/mole
IC50
nM
Kd
nM
EC50/IC50
nM
koff
s-1
kon
M-1s-1
pHTemp
°C
Rho-associated protein kinase 1
(Homo sapiens (Human))
BDBM50299371
(CHEMBL573152 | N2-(2,3-dihydro-1H-inden-2-yl)-6-(4...)
Show SMILES CN1CCN(CC1)c1nc(NC2Cc3ccccc3C2)nc(Nc2ccncc2)n1
Show InChI InChI=1S/C22H26N8/c1-29-10-12-30(13-11-29)22-27-20(24-18-6-8-23-9-7-18)26-21(28-22)25-19-14-16-4-2-3-5-17(16)15-19/h2-9,19H,10-15H2,1H3,(H2,23,24,25,26,27,28)
NCI pathway
Reactome pathway
n/an/a 305n/an/an/an/an/an/a
Ligand Pharmaceuticals, Inc.
Curated by ChEMBL
Assay Description
Inhibition of ROCK1 by IMAP assay
Bioorg Med Chem Lett 19: 6027-31 (2009)
Article DOI: 10.1016/j.bmcl.2009.09.046
BindingDB Entry DOI: 10.7270/Q2668D7P