BDBM50299494 CHEMBL584714::{4-(1-Benzyl-1H-indazol-5-ylamino)-5-ethyl-pyrrolo[2,1-f][1,2,4]triazin-6-yl}-carbamic acid piperidin-3-ylmethyl ester
SMILES: CCC1=C2C(N=C1NC(=O)OCC1CCCNC1)N=CN=C2Nc1ccc2n(Cc3ccccc3)ncc2c1
InChI Key: InChIKey=IZUJRRQQMYQCBU-UHFFFAOYSA-N
Data: 2 IC50
Activity Spreadsheet -- Enzyme Inhibition Constant Data from BindingDB
Found 2 hits for monomerid = 50299494
Trg + Lig
Ki
nM
ΔG°
kcal/mole
IC50
nM
Kd
nM
EC50/IC50
nM
koff
s-1
kon
M-1s-1
pHTemp
°C
Epidermal growth factor receptor
(Homo sapiens (Human))
BDBM50299494
(CHEMBL584714 | {4-(1-Benzyl-1H-indazol-5-ylamino)-...)
Show SMILES CCC1=C2C(N=C1NC(=O)OCC1CCCNC1)N=CN=C2Nc1ccc2n(Cc3ccccc3)ncc2c1 |c:5,20,22,t:2|
Show InChI InChI=1S/C29H32N8O2/c1-2-23-25-27(31-18-32-28(25)35-26(23)36-29(38)39-17-20-9-6-12-30-14-20)34-22-10-11-24-21(13-22)15-33-37(24)16-19-7-4-3-5-8-19/h3-5,7-8,10-11,13,15,18,20,28,30H,2,6,9,12,14,16-17H2,1H3,(H,31,32,34)(H,35,36,38)
n/an/a 38n/an/an/an/an/an/a
Bristol-Myers Squibb Research and Development
Curated by ChEMBL
Assay Description
Inhibition of human recombinant HER1 expressed in Sf9 cells by liquid scintillation counting
J Med Chem 52: 6527-30 (2009)
Article DOI: 10.1021/jm9010065
BindingDB Entry DOI: 10.7270/Q2542PH9
Receptor tyrosine-protein kinase erbB-2
(Homo sapiens (Human))
BDBM50299494
(CHEMBL584714 | {4-(1-Benzyl-1H-indazol-5-ylamino)-...)
Show SMILES CCC1=C2C(N=C1NC(=O)OCC1CCCNC1)N=CN=C2Nc1ccc2n(Cc3ccccc3)ncc2c1 |c:5,20,22,t:2|
Show InChI InChI=1S/C29H32N8O2/c1-2-23-25-27(31-18-32-28(25)35-26(23)36-29(38)39-17-20-9-6-12-30-14-20)34-22-10-11-24-21(13-22)15-33-37(24)16-19-7-4-3-5-8-19/h3-5,7-8,10-11,13,15,18,20,28,30H,2,6,9,12,14,16-17H2,1H3,(H,31,32,34)(H,35,36,38)
n/an/a 29n/an/an/an/an/an/a
Bristol-Myers Squibb Research and Development
Curated by ChEMBL
Assay Description
Inhibition of human recombinant HER2 expressed in Sf9 cells by liquid scintillation counting
J Med Chem 52: 6527-30 (2009)
Article DOI: 10.1021/jm9010065
BindingDB Entry DOI: 10.7270/Q2542PH9