BDBM50299592 CHEMBL576283::N-(4-methoxyphenyl)-1-(5-methyl-7H-pyrrolo[2,3-d]pyrimidin-4-yl)piperidine-4-carboxamide
SMILES: COc1ccc(NC(=O)C2CCN(CC2)c2ncnc3[nH]cc(C)c23)cc1
InChI Key: InChIKey=YUZYPXOGQFDMIJ-UHFFFAOYSA-N
Data: 1 IC50
Activity Spreadsheet -- Enzyme Inhibition Constant Data from BindingDB
Found 1 hit for monomerid = 50299592
Trg + Lig
Ki
nM
ΔG°
kcal/mole
IC50
nM
Kd
nM
EC50/IC50
nM
koff
s-1
kon
M-1s-1
pHTemp
°C
LIM domain kinase 2
(Homo sapiens (Human))
BDBM50299592
(CHEMBL576283 | N-(4-methoxyphenyl)-1-(5-methyl-7H-...)
Show SMILES COc1ccc(NC(=O)C2CCN(CC2)c2ncnc3[nH]cc(C)c23)cc1
Show InChI InChI=1S/C20H23N5O2/c1-13-11-21-18-17(13)19(23-12-22-18)25-9-7-14(8-10-25)20(26)24-15-3-5-16(27-2)6-4-15/h3-6,11-12,14H,7-10H2,1-2H3,(H,24,26)(H,21,22,23)
NCI pathway
Reactome pathway
n/an/a 1.50E+3n/an/an/an/an/an/a
Princ
Curated by ChEMBL
Assay Description
Inhibition of human recombinant LIMK2 expressed in baculovirus-Sf9 system by scintillation counting
J Med Chem 52: 6515-8 (2009)
Article DOI: 10.1021/jm901226j
BindingDB Entry DOI: 10.7270/Q2HH6K4J