BDBM50299595 4-(5-methyl-7H-pyrrolo[2,3-d]pyrimidin-4-yl)-N-m-tolylpiperazine-1-carboxamide::CHEMBL571715
SMILES: Cc1c[nH]c2ncnc(N3CCN(CC3)C(=O)Nc3cccc(C)c3)c12
InChI Key: InChIKey=QRCVBFDDXGCPTD-UHFFFAOYSA-N
Data: 1 IC50
Activity Spreadsheet -- Enzyme Inhibition Constant Data from BindingDB
Found 1 hit for monomerid = 50299595
Trg + Lig
Ki
nM
ΔG°
kcal/mole
IC50
nM
Kd
nM
EC50/IC50
nM
koff
s-1
kon
M-1s-1
pHTemp
°C
LIM domain kinase 2
(Homo sapiens (Human))
BDBM50299595
(4-(5-methyl-7H-pyrrolo[2,3-d]pyrimidin-4-yl)-N-m-t...)
Show SMILES Cc1c[nH]c2ncnc(N3CCN(CC3)C(=O)Nc3cccc(C)c3)c12
Show InChI InChI=1S/C19H22N6O/c1-13-4-3-5-15(10-13)23-19(26)25-8-6-24(7-9-25)18-16-14(2)11-20-17(16)21-12-22-18/h3-5,10-12H,6-9H2,1-2H3,(H,23,26)(H,20,21,22)
NCI pathway
Reactome pathway
n/an/a 92n/an/an/an/an/an/a
Princ
Curated by ChEMBL
Assay Description
Inhibition of human recombinant LIMK2 expressed in baculovirus-Sf9 system by scintillation counting
J Med Chem 52: 6515-8 (2009)
Article DOI: 10.1021/jm901226j
BindingDB Entry DOI: 10.7270/Q2HH6K4J