BDBM50299615 (S)-N'-cyano-N-(3-cyanophenyl)-2-methyl-4-(5-methyl-7H-pyrrolo[2,3-d]pyrimidin-4-yl)piperazine-1-carboximidamide::CHEMBL569861
SMILES: C[C@H]1CN(CCN1C(NC#N)=Nc1cccc(c1)C#N)c1ncnc2[nH]cc(C)c12
InChI Key: InChIKey=SDZJESDWVOOOKS-HNNXBMFYSA-N
Data: 1 IC50
Activity Spreadsheet -- Enzyme Inhibition Constant Data from BindingDB
Found 1 hit for monomerid = 50299615
Trg + Lig
Ki
nM
ΔG°
kcal/mole
IC50
nM
Kd
nM
EC50/IC50
nM
koff
s-1
kon
M-1s-1
pHTemp
°C
LIM domain kinase 2
(Homo sapiens (Human))
BDBM50299615
((S)-N'-cyano-N-(3-cyanophenyl)-2-methyl-4-(5-methy...)
Show SMILES C[C@H]1CN(CCN1C(NC#N)=Nc1cccc(c1)C#N)c1ncnc2[nH]cc(C)c12 |r,w:11.12|
Show InChI InChI=1S/C21H21N9/c1-14-10-24-19-18(14)20(27-13-26-19)29-6-7-30(15(2)11-29)21(25-12-23)28-17-5-3-4-16(8-17)9-22/h3-5,8,10,13,15H,6-7,11H2,1-2H3,(H,25,28)(H,24,26,27)/t15-/m0/s1
NCI pathway
Reactome pathway
n/an/a 1.20n/an/an/an/an/an/a
Princ
Curated by ChEMBL
Assay Description
Inhibition of human recombinant LIMK2 expressed in baculovirus-Sf9 system by scintillation counting
J Med Chem 52: 6515-8 (2009)
Article DOI: 10.1021/jm901226j
BindingDB Entry DOI: 10.7270/Q2HH6K4J