BDBM50299819 (+/-)-syn-6,7-Bis(4-bromophenyl)-2-fluoro-12-methyl-7,12-dihydro-6H-chromeno[4,3-d][1,2,4]triazolo[1,5-a]pyrimidine::CHEMBL567403
SMILES: CN1c2ncnn2C(C2=C1c1cc(F)ccc1OC2c1ccc(Br)cc1)c1ccc(Br)cc1
InChI Key: InChIKey=XINIOUUODXKWOD-UHFFFAOYSA-N
Data: 1 IC50
Activity Spreadsheet -- Enzyme Inhibition Constant Data from BindingDB
Found 1 hit for monomerid = 50299819
Trg + Lig
Ki
nM
ΔG°
kcal/mole
IC50
nM
Kd
nM
EC50/IC50
nM
koff
s-1
kon
M-1s-1
pHTemp
°C
CREB-binding protein/p53
(Homo sapiens (Human))
BDBM50299819
((+/-)-syn-6,7-Bis(4-bromophenyl)-2-fluoro-12-methy...)
Show SMILES CN1c2ncnn2C(C2=C1c1cc(F)ccc1OC2c1ccc(Br)cc1)c1ccc(Br)cc1 |c:9|
Show InChI InChI=1S/C25H17Br2FN4O/c1-31-23-19-12-18(28)10-11-20(19)33-24(15-4-8-17(27)9-5-15)21(23)22(32-25(31)29-13-30-32)14-2-6-16(26)7-3-14/h2-13,22,24H,1H3
n/an/a 44n/an/an/an/an/an/a
Amgen Inc.
Curated by ChEMBL
Assay Description
Induction of p53 in human HCT116 cells coexpressing pp53TA-luc assessed as inhibition of cell proliferation after 8 hrs by firefly/renilla luciferase...
J Med Chem 52: 7044-53 (2009)
Article DOI: 10.1021/jm900681h
BindingDB Entry DOI: 10.7270/Q2ZK5GRQ