BDBM50300019 2-(4-(1H-Imidazol-5-yl)phenyl)-1H-benzo[d]imidazole-4-carboxamide::CHEMBL576319
SMILES: NC(=O)c1cccc2[nH]c(nc12)-c1ccc(cc1)-c1c[nH]cn1
InChI Key: InChIKey=OFNRNSWBCGLJIV-UHFFFAOYSA-N
Data: 1 KI  1 EC50
Activity Spreadsheet -- Enzyme Inhibition Constant Data from BindingDB
Found 2 hits for monomerid = 50300019
Trg + Lig
Ki
nM
ΔG°
kcal/mole
IC50
nM
Kd
nM
EC50/IC50
nM
koff
s-1
kon
M-1s-1
pHTemp
°C
Poly [ADP-ribose] polymerase 1
(Homo sapiens (Human))
BDBM50300019
(2-(4-(1H-Imidazol-5-yl)phenyl)-1H-benzo[d]imidazol...)
Show SMILES NC(=O)c1cccc2[nH]c(nc12)-c1ccc(cc1)-c1c[nH]cn1
Show InChI InChI=1S/C17H13N5O/c18-16(23)12-2-1-3-13-15(12)22-17(21-13)11-6-4-10(5-7-11)14-8-19-9-20-14/h1-9H,(H2,18,23)(H,19,20)(H,21,22)
1.20n/an/an/an/an/an/an/an/a
Abbott Laboratories
Curated by ChEMBL
Assay Description
Inhibition of PARP1 by scintillation counting
J Med Chem 52: 6803-13 (2009)
Article DOI: 10.1021/jm900697r
BindingDB Entry DOI: 10.7270/Q2DN4548
Poly [ADP-ribose] polymerase 1
(Homo sapiens (Human))
BDBM50300019
(2-(4-(1H-Imidazol-5-yl)phenyl)-1H-benzo[d]imidazol...)
Show SMILES NC(=O)c1cccc2[nH]c(nc12)-c1ccc(cc1)-c1c[nH]cn1
Show InChI InChI=1S/C17H13N5O/c18-16(23)12-2-1-3-13-15(12)22-17(21-13)11-6-4-10(5-7-11)14-8-19-9-20-14/h1-9H,(H2,18,23)(H,19,20)(H,21,22)
n/an/an/an/a 3.70n/an/an/an/a
Abbott Laboratories
Curated by ChEMBL
Assay Description
Inhibition of PARP1 in human C41 cells after 30 mins by cell-based assay
J Med Chem 52: 6803-13 (2009)
Article DOI: 10.1021/jm900697r
BindingDB Entry DOI: 10.7270/Q2DN4548