BDBM50300020 2-(4-(1H-Imidazol-2-yl)phenyl)-1H-benzo[d]imidazole-4-carboxamide::CHEMBL565881
SMILES: NC(=O)c1cccc2[nH]c(nc12)-c1ccc(cc1)-c1ncc[nH]1
InChI Key: InChIKey=TZFGFYOHWMJQCL-UHFFFAOYSA-N
Data: 1 KI  1 EC50
Activity Spreadsheet -- Enzyme Inhibition Constant Data from BindingDB
Found 2 hits for monomerid = 50300020
Trg + Lig
Ki
nM
ΔG°
kcal/mole
IC50
nM
Kd
nM
EC50/IC50
nM
koff
s-1
kon
M-1s-1
pHTemp
°C
Poly [ADP-ribose] polymerase 1
(Homo sapiens (Human))
BDBM50300020
(2-(4-(1H-Imidazol-2-yl)phenyl)-1H-benzo[d]imidazol...)
Show SMILES NC(=O)c1cccc2[nH]c(nc12)-c1ccc(cc1)-c1ncc[nH]1
Show InChI InChI=1S/C17H13N5O/c18-15(23)12-2-1-3-13-14(12)22-17(21-13)11-6-4-10(5-7-11)16-19-8-9-20-16/h1-9H,(H2,18,23)(H,19,20)(H,21,22)
2.20n/an/an/an/an/an/an/an/a
Abbott Laboratories
Curated by ChEMBL
Assay Description
Inhibition of PARP1 by scintillation counting
J Med Chem 52: 6803-13 (2009)
Article DOI: 10.1021/jm900697r
BindingDB Entry DOI: 10.7270/Q2DN4548
Poly [ADP-ribose] polymerase 1
(Homo sapiens (Human))
BDBM50300020
(2-(4-(1H-Imidazol-2-yl)phenyl)-1H-benzo[d]imidazol...)
Show SMILES NC(=O)c1cccc2[nH]c(nc12)-c1ccc(cc1)-c1ncc[nH]1
Show InChI InChI=1S/C17H13N5O/c18-15(23)12-2-1-3-13-14(12)22-17(21-13)11-6-4-10(5-7-11)16-19-8-9-20-16/h1-9H,(H2,18,23)(H,19,20)(H,21,22)
n/an/an/an/a 2.20n/an/an/an/a
Abbott Laboratories
Curated by ChEMBL
Assay Description
Inhibition of PARP1 in human C41 cells after 30 mins by cell-based assay
J Med Chem 52: 6803-13 (2009)
Article DOI: 10.1021/jm900697r
BindingDB Entry DOI: 10.7270/Q2DN4548